{"text_format":"1","workbook":"xlsx","n_sheets":80,"sheets":["Cover","Purpose of spreadsheet","Version Control","Factor List","Summary - LGPS_EW","x-Series Number","AnnGenHiddenLists","Club 2023 Tables 1&2","Club 2023 Table 3","Club 2023 Table 4","Club 2023 Table 5","Club 2023 Table 6","x-201","x-202","x-203","x-204","x-205","x-206","x-207","x-208","x-209","x-210","x-211","x-212","x-213","x-214","x-215","x-216","x-217","x-219","x-301","x-302","x-303","x-304","x-305","x-306","x-307","x-308","x-309","x-314","x-315","x-316","x-317","x-401","x-402","x-501","x-502","x-503","x-504","x-505","x-603","x-609","x-610","x-701","x-702","x-703","x-704","x-705","x-706","x-707","x-708","x-711","x-712","x-713","x-714","x-715","x-716","x-717","x-718","x-719","x-720","x-801","x-802","x-803","x-806","x-807","x-808","x-809","x-810","x-811"],"not_rendered":{"charts":0,"images":0,"macros":1,"external_links":1,"defined_names":2041,"comments":0,"pivot_tables":0},"unopened":[],"bounds":{"document_bytes":16777216,"sheet_cells":100000,"rows_first":2000,"rows_last":500,"rows_between":2000,"halvings":0,"cell_chars":16384,"cell_head_chars":4096},"cells_cut":0,"cells_raw":0,"read":"whole","date_system":"1900"}

{"sheet":"Cover","index":0,"n_rows":22,"n_cols":2,"rows_kept":22,"cut":false,"hidden":false,"merged":[]}
["Government Actuary's Department"]
["Local Government Pension Scheme (LGPS) - Consolidated Factor Spreadsheet"]
["Cover"]
[]
[]
[]
["Specification","This spreadsheet contains the updated factors for the LGPS_EW."]
[]
[]
[]
["Sheet","Description"]
["Purpose of spreadsheet","This sheet sets out the purpose of the spreadsheet and includes caveats on the use of the spreadsheet."]
["Version Control ","This sheet is used to show which factor tables have been updated since the last issued version of the consolidated factor spreadsheet."]
["Factor List","This sheet lists the full suite of factors that are in force together with the following information: "]
["x-101 and onwards","The 100 series factors contain the club transfer factors. Administrators need to ensure that they use up-to-date Club factors as published by the Cabinet Office, regardless of whether they coincide with the relevant factors set out in this factor suite. Each different type of club transfer factor is set out on a separate sheet starting with sheet x-102, where x relates to the scheme section (if applicable). "]
["x-201 and onwards","The 200 series factors contain the non club transfer factors. Each different type of non club transfer factor is set out on a separate sheet starting with sheet x-201, where x relates to the scheme section (if applicable). Male and female factors for the same type of factor are shown on the same sheet."]
["x-301 and onwards","The 300 series factors contain the pension sharing on divorce factors. Each different type of pension sharing on divorce factor is set out on a separate sheet starting with sheet x-301, where x relates to the scheme section (if applicable). Male and female factors for the same type of factor are shown on the same sheet."]
["x-401 and onwards","The 400 series factors contain the early and late retirement factors. Each different type of early or late retirement factor is set out on a separate sheet starting with sheet x-401, where x relates to the scheme section (if applicable). Male and female factors for the same type of factor are shown on the same sheet."]
["x-501 and onwards","The 500 series factors contain the commutation factors. Each different type of commutation factor is set out on a separate sheet starting with sheet x-501, where x relates to the scheme section (if applicable). "]
["x-601 and onwards","The 600 series factors contain the scheme pays factors. Each different type of scheme pays factor is set out on a separate sheet starting with sheet x-601, where x relates to the scheme section (if applicable)."]
["x-701 and onwards","The 700 series factors contain the additional benefit or additional contribution factors. Each different type of additional benefit or additional contribution factor is set out on a separate sheet starting with sheet x-701, where x relates to the scheme section (if applicable). "]
["x-801 and onwards","The 800 series factors contain the other scheme specific factors. Each different type of other scheme specific factor is set out on a separate sheet starting with sheet x-801, where x relates to the scheme section (if applicable). "]

{"sheet":"Purpose of spreadsheet","index":1,"n_rows":9,"n_cols":1,"rows_kept":9,"cut":false,"hidden":false,"merged":[[6,0,6,12],[8,0,11,12]]}
["Government Actuary's Department"]
[{"$f":"IF(TITLE=\"> Enter workbook title here\",\"Enter workbook title in Cover sheet\",TITLE)","v":"Local Government Pension Scheme (LGPS) - Consolidated Factor Spreadsheet"}]
["Purpose of Spreadsheet"]
[]
[]
[]
["Purpose of the Department of Leveling Up, Housing and Communities (\"DLUHC\") Consolidated Factor Spreadsheet"]
[]
["This spreadsheet is provided by GAD at the request of Department of Leveling Up, Housing and Communities (\"DLUHC\").  Its purpose is to set out in one place for convenience the actuarial factors provided by GAD to DLUHC from time to time in respect of Local Government Pension Scheme (England and Wales) and related schemes, and the dates on which these factors have been sent to the client and implemented by the client.  It should not be used or relied on for any other purpose and GAD has no liability for any act or omission taken on the basis of this spreadsheet.  In particular, it does not constitute an instruction or manual for plan administration purposes, and it does not cover the implementation or backdating of factors other than to specify the factor implementation date (if provided by DLUHC).   \n\nGAD has no liability for any changes made to this spreadsheet whilst being used by DLUHC or any other third party.\n\nThis spreadsheet should not be made available online without the express permission of GAD. \n\nThis spreadsheet is password protected. \n"]

{"sheet":"Version Control","index":2,"n_rows":148,"n_cols":3,"rows_kept":148,"cut":false,"hidden":false,"merged":[]}
["Government Actuary's Department"]
[{"$f":"IF(TITLE=\"> Enter workbook title here\",\"Enter workbook title in Cover sheet\",TITLE)","v":"Local Government Pension Scheme (LGPS) - Consolidated Factor Spreadsheet"}]
["Version Control"]
[]
[]
["Version control"]
[]
["This sheet is intended to assist DLUHC in understanding which factors have changed and when. "]
["Version control on this sheet commences with the 2017/18 factor review (version 2018-1)"]
[]
["Version 2018 - 01 (November 2018)"]
["Provides the following new factor tables:",null,"none"]
["Provides the following revised factors:",null,"x-200 series x-300 series"]
["Confirms that the following factor table is no longer required for LGPS:",null,"none"]
["Factors still to follow:",null,"all other series"]
["Methodology changes:",null,"none - table should be used with existing guidance notes as referenced"]
["Date modified:",null,"2018-11-09T19:45:00"]
[]
[]
["Version 2018 - 02 (November 2018)"]
["Provides the following new factor tables:",null,"none"]
["Provides the following revised factors:",null,"x-200, x-300, x-400 series (ERF only)"]
["Confirms that the following factor table is no longer required for LGPS:",null,"none"]
["Factors still to follow:",null,"all other series"]
["Methodology changes:",null,"none - table should be used with existing guidance notes as referenced"]
["Date modified:",null,"2018-11-26T09:00:00"]
[]
[]
["Version 2018 - 03 (December 2018)"]
["Provides the following new factor tables:",null,"none"]
["Provides the following revised factors:",null,"x-200, x-300 (excl. Pension Credit post 2014), x-400 series (ERF only), x-500 (Triv Comm only)"]
["Confirms that the following factor table is no longer required for LGPS:",null,"none"]
["Factors still to follow:",null,"x-300 (Pension Credit post 2014), x-400 series (LRF), x-500 (Inverse Comm), all other series"]
["Methodology changes:",null,"none - table should be used with existing guidance notes as referenced"]
["Date modified:",null,"2018-12-19T09:00:00"]
[]
[]
["Version 2019 - 01 (February 2019)"]
["Provides the following new factor tables:",null,"none"]
["Provides the following revised factors:",null,"x-200, x-300, x-400 series (ERF only), x-500 (Triv Comm only), x-600 (LTA only), x-700 (post 2014 only)"]
["Confirms that the following factor table is no longer required for LGPS:",null,"none"]
["Factors still to follow:",null,"x-400 series (LRF), x-500 (Inverse Comm), x-600 (AA), x-700 (pre 2014) all other series"]
["Methodology changes:",null,"0-309 (pension credit), 0-711 to 0-720 (added pension post 2014) tables are in new formats and should be used with new guidance notes referenced. \nOthers table should be used with existing guidance notes as referenced"]
["Date modified:",null,"2019-02-18T09:00:00"]
[]
[]
["Version 2019 - 02 (13 March 2019)"]
["Provides the following new factor tables:",null,"none"]
["Provides the following revised factors:",null,"x-200, x-300, x-400 series (ERF only), x-500 (Triv Comm only), x-600 (LTA only), x-700"]
["Confirms that the following factor table is no longer required for LGPS:",null,"none"]
["Factors still to follow:",null,"x-400 series (LRF), x-500 (Inverse Comm), x-600 (AA), all other series"]
["Methodology changes:",null,"0-309 (pension credit), 0-711 to 0-720 (added pension post 2014) tables are in new formats and should be used with new guidance notes referenced. \nOthers table should be used with existing guidance notes as referenced"]
["Date modified:",null,"2019-03-13T18:00:00"]
[]
[]
["Version 2019 - 03 (22 March 2019)"]
["Provides the following new factor tables:",null,"none"]
["Provides the following revised factors:",null,"x-103 to x-110 (Club 65 to 68 male and female) tables; x-219 (CRA conversion factors)"]
["Confirms that the following factor table is no longer required for LGPS:",null,"none"]
["Factors still to follow:",null,"x-400 series (LRF), x-500 (Inverse Comm), x-600 (AA), all other series"]
["Methodology changes:",null,"0-309 (pension credit), 0-711 to 0-720 (added pension post 2014) tables are in new formats and should be used with new guidance notes referenced. \nOthers table should be used with existing guidance notes as referenced"]
["Date modified:",null,"2019-03-19T14:00:00"]
[]
[]
["Version 2019 - 04 (28 May 2019)"]
["Provides the following new factor tables:",null,"none"]
["Provides the following revised factors:",null,"x-500 (Inverse Comm), x-600 (AA scheme pays), x-800 (AVC conversions)"]
["Confirms that the following factor table is no longer required for LGPS:",null,"none"]
["Factors still to follow:",null,"x-400 series (LRF), x-800 (Additional Survivor Benefits)"]
["Methodology changes:",null,"0-309 (pension credit), 0-603 (AA scheme pays post 2014), 0-711 to 0-720 (added pension post 2014) tables are in new formats and should be used with new guidance notes referenced. \nOthers table should be used with existing guidance notes as referenced"]
["Date modified:",null,"2019-05-28T09:00:00"]
[]
[]
["Version 2019 - 05 (28 June 2019)"]
["Provides the following new factor tables:",null,"x-402 (Late retirement)"]
["Provides the following revised factors:",null,"none"]
["Confirms that the following factor table is no longer required for LGPS:",null,"none"]
["Factors still to follow:",null,"x-800 (Additional Survivor Benefits)"]
["Methodology changes:",null,"0-402 is a new table (replacing single factors) and should be used with new guidance notes referenced. "]
["Date modified:",null,"2019-06-28T16:00:00"]
[]
[]
["Version 2019 - 06 (23 July 2019)"]
["Provides the following new factor tables:",null,"x-800 (Additional Survivor Benefits)"]
["Provides the following revised factors:",null,"none"]
["Confirms that the following factor table is no longer required for LGPS:",null,"none"]
["Factors still to follow:",null,"none"]
["Methodology changes:",null,"none - ASB tables should be used with existing guidance notes as referenced"]
["Date modified:",null,"2019-07-23T09:00:00"]
[]
[]
["Version 2019 - 07 (9 Aug 2019)"]
["Corrects the description of the tables 808-811 in the 'Factor list sheet, and changes the implementation date of those tables from 31 July to 8 August 2019. "]
["Provides the following new factor tables:",null,"none"]
["Provides the following revised factors:",null,"none"]
["Confirms that the following factor table is no longer required for LGPS:",null,"none"]
["Factors still to follow:",null,"none"]
["Methodology changes:",null,"none - ASB tables should be used with existing guidance notes as referenced"]
["Date modified:",null,"2019-08-09T12:15:00"]
[]
[]
["Version 2019 - 08 (19 Sep 2019)"]
["New immediate club factor table (based on NPA60 table from Club Memorandum applying from 1 April 2019)\nCorrection to club factor tables 103-110 (to align with Club Memorandum applying from 1 April 2019)"]
["Provides the following new factor tables:",null,"x-102 (Club factors - immediate benefits)"]
["Provides the following revised factors:",null,"x-103-110 (Club factors)"]
["Confirms that the following factor table is no longer required for LGPS:",null,"none"]
["Factors still to follow:",null,"none"]
["Methodology changes:",null,"none"]
["Date modified:",null,"2019-09-19T16:00:00"]
[]
[]
["Version 2019 - 09 (20 Dec 2019)"]
["New non-club transfer in factor (with final salary link) table 0-217\nUpdated non-club transfer tables 201-216 (GMP adjustment: CETV new factors; TVIN factors withdrawn - columns retained with zeros)",null,"Please note that MHCLG have determined that this version of the consolidated factor workbook will come into force from 01/11/2020."]
["Provides the following new factor tables:",null,"x-217 (Non-Club transfer in factors - final salary link)"]
["Provides the following revised factors:",null,"x-201-216 (Non-Club factors - GMP adjustments updated(CETV) withdrawn (TVIN))"]
["Confirms that the following factor table is no longer required for LGPS:",null,"none"]
["Factors still to follow:",null,"none"]
["Methodology changes:",null,"none"]
["Date modified:",null,"2019-12-20T16:00:00"]
[]
[]
["Version 2023-01"]
["Provides the following new factor tables:"]
["Provides the following updated factor tables:",null,"x-201 to x-208, x-219, x-301 to x-309, x-314 and x-316"]
["Methodology changes:"]
["Date Modified:",null,"2023-05-25"]
[]
["Version 2023-02"]
["Provides the following new factor tables:"]
["Provides the following updated factor tables:",null,"x-209 to x-217, x-315, x-317, x-401 to x-402"]
["Withdrawn factor tables:"]
["Methodology changes:"]
["Date Modified:",null,"2023-06-30"]
[]
["Version 2023-03"]
["Provides the following new factor tables:"]
["Provides the following updated factor tables:",null,"x-501 to x-505, x-603, x-609 to x-610"]
["Withdrawn factor tables:"]
["Methodology changes:"]
["Date Modified:",null,"2023-07-27"]
[]
[]
["Version 2023-04"]
["Provides the following new factor tables:",null,"Club 2023 Tables 1-2, 3, 4, 5, 6 (copies of updated Club factors)"]
["Provides the following updated factor tables:",null,"x-701 to x-708, x-711 to x-720, x-801 to x-803, x-806 to x-807, x-808 to x-811"]
["Withdrawn factor tables:",null,"x-102 to x-110 (old Club factors. These have been replaced by Club 2023 Tables 2-6)"]
["Methodology changes:"]
["Date Modified:",null,"2023-09-26"]

{"sheet":"Factor List","index":3,"n_rows":86,"n_cols":15,"rows_kept":86,"cut":false,"hidden":false,"merged":[]}
["Government Actuary's Department"]
[{"$f":"IF(TITLE=\"> Enter workbook title here\",\"Enter workbook title in Cover sheet\",TITLE)","v":"Local Government Pension Scheme (LGPS) - Consolidated Factor Spreadsheet"}]
["Factor List"]
[]
[]
[]
["Link to Tables","Scheme","Section","Factor Type","Description","Gender","Factor Age/Period Definition","Section Number (x)","Series Number","Table Reference\n(Section-Series Number)","Table Reference in Guidance","Related Factor Guidance Note","Date Factors Issued to Client","Date Factors Implemented (if known)","Factor Status"]
[]
[{"$f":"HYPERLINK(\"#'\"&K9&\"'!A1\",\"\"&K9)","v":"Club 2023 Tables 1&2"},"LGPS_EW","Club","CETV","Club transfer factors for valuing immediate benefit payment ","Unisex","Age last birthday at relevant date",0,102,"0-102","Club 2023 Tables 1&2","LGPS EW Individual Transfers 8 April 2020","2023-08-31","2023-10-01","Issued"]
[{"$f":"HYPERLINK(\"#'\"&K10&\"'!A1\",\"\"&K10)","v":"Club 2023 Table 3"},"LGPS_EW","Club","CETV","Club transfer factors based on Normal Pension Age of 65","Unisex","Age last birthday at relevant date",0,103,"0-103","Club 2023 Table 3","LGPS EW Individual Transfers 8 April 2020","2023-08-31","2023-10-01","Issued"]
["Club 2023 Table 4","LGPS_EW","Club","CETV","Club transfer factors based on Normal Pension Age of 66","Unisex","Age last birthday at relevant date",0,104,"0-104","Club 2023 Table 4","LGPS EW Individual Transfers 8 April 2020","2023-08-31","2023-10-01","Issued"]
["Club 2023 Table 5","LGPS_EW","Club","CETV","Club transfer factors based on Normal Pension Age of 67","Unisex","Age last birthday at relevant date",0,105,"0-105","Club 2023 Table 5","LGPS EW Individual Transfers 8 April 2020","2023-08-31","2023-10-01","Issued"]
[{"$f":"HYPERLINK(\"#'\"&K13&\"'!A1\",\"\"&K13)","v":"Club 2023 Table 6"},"LGPS_EW","Club","CETV","Club transfer factors based on Normal Pension Age of 68","Unisex","Age last birthday at relevant date",0,106,"0-106","Club 2023 Table 6","LGPS EW Individual Transfers 8 April 2020","2023-08-31","2023-10-01","Issued"]
[{"$f":"HYPERLINK(\"#'x-\"&I14 & \"'!A1\",\"x-\"&I14)","v":"x-201"},"LGPS_EW","All","CETV","Non club transfers based on NPA 65","Male","Age last birthday at relevant date",0,201,"0-201","Table 9","LGPS EW Individual Transfers 8 April 2020","2023-05-25","2023-06-01","Issued"]
["x-202","LGPS_EW","All","CETV","Non club transfers based on NPA 65","Female","Age last birthday at relevant date",0,202,"0-202","Table 10","LGPS EW Individual Transfers 8 April 2020","2023-05-25","2023-06-01","Issued"]
["x-203","LGPS_EW","All","CETV","Non club transfers based on NPA 66","Male","Age last birthday at relevant date",0,203,"0-203","Table 11","LGPS EW Individual Transfers 8 April 2020","2023-05-25","2023-06-01","Issued"]
["x-204","LGPS_EW","All","CETV","Non club transfers based on NPA 66","Female","Age last birthday at relevant date",0,204,"0-204","Table 12","LGPS EW Individual Transfers 8 April 2020","2023-05-25","2023-06-01","Issued"]
["x-205","LGPS_EW","All","CETV","Non club transfers based on NPA 67","Male","Age last birthday at relevant date",0,205,"0-205","Table 13","LGPS EW Individual Transfers 8 April 2020","2023-05-25","2023-06-01","Issued"]
["x-206","LGPS_EW","All","CETV","Non club transfers based on NPA 67","Female","Age last birthday at relevant date",0,206,"0-206","Table 14","LGPS EW Individual Transfers 8 April 2020","2023-05-25","2023-06-01","Issued"]
["x-207","LGPS_EW","All","CETV","Non club transfers based on NPA 68","Male","Age last birthday at relevant date",0,207,"0-207","Table 15","LGPS EW Individual Transfers 8 April 2020","2023-05-25","2023-06-01","Issued"]
["x-208","LGPS_EW","All","CETV","Non club transfers based on NPA 68","Female","Age last birthday at relevant date",0,208,"0-208","Table 16","LGPS EW Individual Transfers 8 April 2020","2023-05-25","2023-06-01","Issued"]
["x-209","LGPS_EW","All","TV In (non-club)","Factors for non-club transfers-in based on NPA 65 - Males (NPA65)","Male","Age last birthday at relevant date",0,209,"0-209","Table NM65","LGPS EW Individual Transfers 8 April 2020","2023-06-30","2023-07-03","Issued"]
["x-210","LGPS_EW","All","TV In (non-club)","Factors for non-club transfers-in based on NPA 65 - Females (NPA65)","Female","Age last birthday at relevant date",0,210,"0-210","Table NF65","LGPS EW Individual Transfers 8 April 2020","2023-06-30","2023-07-03","Issued"]
["x-211","LGPS_EW","All","TV In (non-club)","Factors for non-club transfers-in based on NPA 66 - Males (NPA66)","Male","Age last birthday at relevant date",0,211,"0-211","Table NM66","LGPS EW Individual Transfers 8 April 2020","2023-06-30","2023-07-03","Issued"]
["x-212","LGPS_EW","All","TV In (non-club)","Factors for non-club transfers-in based on NPA 66 - Females (NPA66)","Female","Age last birthday at relevant date",0,212,"0-212","Table NF66","LGPS EW Individual Transfers 8 April 2020","2023-06-30","2023-07-03","Issued"]
["x-213","LGPS_EW","All","TV In (non-club)","Factors for non-club transfers-in based on NPA 67 - Males (NPA67)","Male","Age last birthday at relevant date",0,213,"0-213","Table NM67","LGPS EW Individual Transfers 8 April 2020","2023-06-30","2023-07-03","Issued"]
["x-214","LGPS_EW","All","TV In (non-club)","Factors for non-club transfers-in based on NPA 67 - Females (NPA67)","Female","Age last birthday at relevant date",0,214,"0-214","Table NF67","LGPS EW Individual Transfers 8 April 2020","2023-06-30","2023-07-03","Issued"]
["x-215","LGPS_EW","All","TV In (non-club)","Factors for non-club transfers-in based on NPA 68 - Males (NPA68)","Male","Age last birthday at relevant date",0,215,"0-215","Table NM68","LGPS EW Individual Transfers 8 April 2020","2023-06-30","2023-07-03","Issued"]
[{"$f":"HYPERLINK(\"#'x-\"&I29 & \"'!A1\",\"x-\"&I29)","v":"x-216"},"LGPS_EW","All","TV In (non-club)","Factors for non-club transfers-in based on NPA 68 - Females (NPA68)","Female","Age last birthday at relevant date",0,216,"0-216","Table NF68","LGPS EW Individual Transfers 8 April 2020","2023-06-30","2023-07-03","Issued"]
["x-217","LGPS_EW","All","TV In (non-club)","Factors for Non-Club Transfer with Final Salary link","Unisex","Age last birthday at relevant date",0,217,"0-217","Table NUFS","LGPS EW Individual Transfers 8 April 2020","2023-06-30","2023-07-03","Issued"]
["x-219","LGPS_EW","All","CETV","CRA Conversion Factors - Pension and Lump Sum Conversion Factors","Male and Female","Relevant Period (years)",0,219,"0-219","Table 17","LGPS EW Individual Transfers 8 April 2020","2023-05-25","2023-06-01","Issued"]
["x-301","LGPS_EW","All","Pensioner CE","Pensioner cash equivalent factors on divorce - non ill health cases","Male","Age last birthday at relevant date",0,301,"0-301","Table 1.1","LGPS EW Pensioner CE factors on divorce 11 June 2020","2023-05-25","2023-06-01","Issued"]
["x-302","LGPS_EW","All","Pensioner CE","Pensioner cash equivalent factors on divorce - non ill health cases","Female","Age last birthday at relevant date",0,302,"0-302","Table 1.2","LGPS EW Pensioner CE factors on divorce 11 June 2020","2023-05-25","2023-06-01","Issued"]
["x-303","LGPS_EW","All","Pensioner CE","Ill health pensioner cash equivalent factors on divorce","Male","Age last birthday at relevant date",0,303,"0-303","Table 2.1","LGPS EW Pensioner CE factors on divorce 11 June 2020","2023-05-25","2023-06-01","Issued"]
["x-304","LGPS_EW","All","Pensioner CE","Ill health pensioner cash equivalent factors on divorce","Female","Age last birthday at relevant date",0,304,"0-304","Table 2.2","LGPS EW Pensioner CE factors on divorce 11 June 2020","2023-05-25","2023-06-01","Issued"]
["x-305","LGPS_EW","pre 2014","Pension Credit","Pension credit to former spouse or civil partner (pre 2014) - Factors applicable to former spouse or civil partner below age 65","Male","Age last birthday at relevant date",0,305,"0-305","Table 6.1","LGPS EW Application of pension credit to the former spouse or civil partner of a pre-2014 leaver 5 May 2021","2023-05-25","2023-06-01","Issued"]
["x-306","LGPS_EW","pre 2014","Pension Credit","Pension credit to former spouse or civil partner (pre 2014) - Factors applicable to former spouse or civil partner below age 65","Female","Age last birthday at relevant date",0,306,"0-306","Table 6.2","LGPS EW Application of pension credit to the former spouse or civil partner of a pre-2014 leaver 5 May 2021","2023-05-25","2023-06-01","Issued"]
[{"$f":"HYPERLINK(\"#'x-\"&I38 & \"'!A1\",\"x-\"&I38)","v":"x-307"},"LGPS_EW","pre 2014","Pension Credit","Pension credit to former spouse or civil partner (pre 2014) - Factors applicable to former spouse or civil partner age 65 or above","Male","Age last birthday at relevant date",0,307,"0-307","Table 7.1","LGPS EW Application of pension credit to the former spouse or civil partner of a pre-2014 leaver 5 May 2021","2023-05-25","2023-06-01","Issued"]
["x-308","LGPS_EW","pre 2014","Pension Credit","Pension credit to former spouse or civil partner (pre 2014) - Factors applicable to former spouse or civil partner age 65 or above","Female","Age last birthday at relevant date",0,308,"0-308","Table 7.2","LGPS EW Application of pension credit to the former spouse or civil partner of a pre-2014 leaver 5 May 2021","2023-05-25","2023-06-01","Issued"]
["x-309","LGPS_EW","post 2014","Pension Credit","Pension credit factors applicable to former spouse or civil partner (post 2014)","Unisex","Age last birthday at relevant date",0,309,"0-309","Table 4.1","LGPS EW Application of pension credit to the former spouse or civil partner of a post-2014 member 1 April 2019","2023-05-25","2023-06-01","Issued"]
["x-314","LGPS_EW","pre 2014","Pension Debit","Application of pension debit for divorced members (pre 1/4/14) - Reduction to pension and retirement grant debits on ill health retirement","Male & Female","Years Early",0,314,"0-314","Table A","LGPS EW Application of a pension debit for divorced members (transfer date before 1 April 2014). 11 June 2020","2023-05-25","2023-06-01","Issued"]
["x-315","LGPS_EW","pre 2014","Pension Debit","Application of pension debit for divorced members (pre 1/4/14) - Reduction to pension and retirement grant debits on normal health early retirement)","Male & Female","Years Early",0,315,"0-315","Table B","LGPS EW Application of a pension debit for divorced members (transfer date before 1 April 2014). 11 June 2020","2023-06-30","2023-07-03","Issued"]
["x-316","LGPS_EW","post 2014","Pension Debit","Application of a pension debit for divorced members (post-14) - Reduction to pension and retirement grant debits on ill-health retirement","Male & Female","Years Early",0,316,"0-316","Table A","LGPS EW Application of a pension debit for divorced members (transfer date from 1 April 2014). 11 June 2020","2023-05-25","2023-06-01","Issued"]
["x-317","LGPS_EW","post 2014","Pension Debit","Application of a pension debit for divorced members (post-14) - Reduction to pension and retirement grant debits on normal health early retirement","Male & Female","Years Early",0,317,"0-317","Table B","LGPS EW Application of a pension debit for divorced members (transfer date from 1 April 2014). 11 June 2020","2023-06-30","2023-07-03","Issued"]
["x-401","LGPS_EW","All","Early Retirement Factor","Factors to use after age 55","Male & Female","Years Early",0,401,"0-401","Appendix A: Table 1","LGPS EW Early retirement guidance 5 May 2021","2023-06-30","2023-07-03","Issued"]
["x-402","LGPS_EW",2014,"LRF","Late retirement increase for pre and post 31 March 2014 benefits","Unisex","Years Late",0,402,"0-402","Appendix A","LGPS EW Late retirement guidance 5 May 2021","2023-06-30","2023-09-01","Issued"]
["x-501","LGPS_EW","All","Triv Comm","Trivial commutation - Factors for member's pension - Male member","Male","Member's age last birthday at the date of commutation",0,501,"0-501A","Table A","LGPS EW Trivial commutation guidance 15 April 2020","2023-07-27","2023-07-28","Issued"]
["x-501","LGPS_EW","All","Triv Comm","Trivial commutation - Factors for member's pension - Female member","Female","Member's age last birthday at the date of commutation",0,501,"0-501B","Table A","LGPS EW Trivial commutation guidance 15 April 2020","2023-07-27","2023-07-28","Issued"]
["x-502","LGPS_EW","All","Triv Comm","Trivial commutation - Factors for surviving adult dependant's and pension credit member's pension - Females","Female","Age last birthday",0,502,"0-502A","Table B","LGPS EW Trivial commutation guidance 15 April 2020","2023-07-27","2023-07-28","Issued"]
["x-502","LGPS_EW","All","Triv Comm","Trivial commutation - Factors for surviving adult dependant's and pension credit member's pension - Males","Male","Age last birthday",0,502,"0-502B","Table B","LGPS EW Trivial commutation guidance 15 April 2020","2023-07-27","2023-07-28","Issued"]
["x-503","LGPS_EW","All","Triv Comm"," Trivial commutation - Factors for children's pension","Unisex","Age last birthday of child (male and female)",0,503,"0-503A","Table C","LGPS EW Trivial commutation guidance 15 April 2020","2023-07-27","2023-07-28","Issued"]
["x-503","LGPS_EW","All","Triv Comm","Trivial commutation - Factors for children's pension","Unisex","Number of years expected to remain in full-time education",0,503,"0-503B","Table C","LGPS EW Trivial commutation guidance 15 April 2020","2023-07-27","2023-07-28","Issued"]
["x-504","LGPS_EW","All","Inverse Comm","Inverse Commutation Factors - Amount of additional pension for every £100 of lump sum\nNormal Retirement (ages 55 to 75)","Male & Female","Age at date member becomes entitled to an immediate pension in years and complete months",0,504,"0-504A","Table A","LGPS EW Inverse commutation reg 58 5 May 2021","2023-07-27","2023-07-28","Issued"]
["x-504","LGPS_EW","All","Inverse Comm","Inverse Commutation Factors - Amount of additional pension for every £100 of lump sum\nNormal Retirement (ages 55 to 75)","Male & Female","Age at date member becomes entitled to an immediate pension in years and complete months",0,504,"0-504B","Table A","LGPS EW Inverse commutation reg 58 5 May 2021","2023-07-27","2023-07-28","Issued"]
["x-505","LGPS_EW","All","Inverse Comm","Inverse Commutation Factors - Amount of additional pension for every £100 of lump sum \nIll-Health Retirement (ages 30 to 75)","Male & Female","Age at date member becomes entitled to an immediate pension in years and complete months",0,505,"0-505A","Table B","LGPS EW Inverse commutation reg 58 5 May 2021","2023-07-27","2023-07-28","Issued"]
["x-505","LGPS_EW","All","Inverse Comm","Inverse Commutation Factors - Amount of additional pension for every £100 of lump sum \nIll-Health Retirement (ages 30 to 75)","Male & Female","Age at date member becomes entitled to an immediate pension in years and complete months",0,505,"0-505B","Table B","LGPS EW Inverse commutation reg 58 5 May 2021","2023-07-27","2023-07-28","Issued"]
["x-603","LGPS_EW","Post-14","Scheme pays AA","Scheme pays factors for males and females","Unisex","Age last birthday at relevant date",0,603,"0-603","Table A1","LGPS EW Annual Allowance charges: Calculation of scheme pays 5 May 2021","2023-07-27","2023-07-28","Issued"]
["x-609","LGPS_EW","All","Scheme pays LTA","Limit on total amount of benefits - Lifetime allowance - Factors for calculating LTA debit (non ill-health cases)","Male & Female","Age last birthday at retirement",0,609,"0-609","Table A","Limit on Total Amount of Benefits – Lifetime Allowance 14 April 2016","2023-07-27","2023-07-28","Issued"]
["x-610","LGPS_EW","All","Scheme pays LTA","Limit on total amount of benefits - Lifetime allowance - Factors for calculating LTA debit (retirement in ill health)","Male & Female","Age last birthday at retirement",0,610,"0-610","Table B","Limit on Total Amount of Benefits – Lifetime Allowance 14 April 2016","2023-07-27","2023-07-28","Issued"]
["x-701","LGPS_EW","pre 2012","Added pension","Additional own pension - regular monthly contributions - Males (purchase of additional pension prior to April 2012) - (monthly payment (£) to purchase £250 additional pension)","Male","Age at first contribution",0,701,"0-701","Table A","LGPS EW Purchase of additional pension - Elections before 1 April 2012. 5 May 2021","2023-09-26","2023-10-02","Issued"]
["x-702","LGPS_EW","pre 2012","Added pension","Additional own pension - regular monthly contributions - Females (purchase of additional pension prior to April 2012) - (monthly payment (£) to purchase £250 additional pension)","Female","Age at first contribution",0,702,"0-702","Table B","LGPS EW Purchase of additional pension - Elections before 1 April 2012. 5 May 2021","2023-09-26","2023-10-02","Issued"]
["x-703","LGPS_EW","pre 2012","Added pension","Additional own and dependant's pension - regular monthly contributions - Males (purchase of additional pension prior to April 2012) - (monthly payment (£) to purchase £250 additional pension)","Male","Age at first contribution",0,703,"0-703","Table C","LGPS EW Purchase of additional pension - Elections before 1 April 2012. 5 May 2021","2023-09-26","2023-10-02","Issued"]
["x-704","LGPS_EW","pre 2012","Added pension","Additional own and dependant's pension - regular monthly contributions - Females (purchase of additional pension prior to April 2012) - (monthly payment (£) to purchase £250 additional pension)","Female","Age at first contribution",0,704,"0-704","Table D","LGPS EW Purchase of additional pension - Elections before 1 April 2012. 5 May 2021","2023-09-26","2023-10-02","Issued"]
["x-705","LGPS_EW","2012-2014","Added pension","Additional own pension - regular monthly contributions - Males (elections between April 2012 and March 2014) - (monthly payment (£) to purchase £250 additional pension)","Male","Age at first contribution",0,705,"0-705","Table C","LGPS EW Purchase of additional pension for elections April 2012 to 31 March 2014. 5 May 2021","2023-09-26","2023-10-02","Issued"]
["x-706","LGPS_EW","2012-2014","Added pension","Additional own pension - regular monthly contributions - Females (elections between April 2012 and March 2014) - (monthly payment (£) to purchase £250 additional pension)","Female","Age at first contribution",0,706,"0-706","Table D","LGPS EW Purchase of additional pension for elections April 2012 to 31 March 2014. 5 May 2021","2023-09-26","2023-10-02","Issued"]
["x-707","LGPS_EW","2012-2014","Added pension","Additional own and dependant's pension - regular monthly contributions - Males (elections between April 2012 and March 2014) - (monthly payment (£) to purchase £250 additional pension)","Male","Age at first contribution",0,707,"0-707","Table E","LGPS EW Purchase of additional pension for elections April 2012 to 31 March 2014. 5 May 2021","2023-09-26","2023-10-02","Issued"]
["x-708","LGPS_EW","2012-2014","Added pension","Additional own and dependant's pension - regular monthly contributions - Females (elections between April 2012 and March 2014) - (monthly payment (£) to purchase £250 additional pension)","Female","Age at first contribution",0,708,"0-708","Table F","LGPS EW Purchase of additional pension for elections April 2012 to 31 March 2014. 5 May 2021","2023-09-26","2023-10-02","Issued"]
["x-711","LGPS_EW","post 2014","Added pension","Additional pension - lump sum contributions - Males  (purchase of additional pension after 1 April 2014)","Male","Age at payment",0,711,"0-711","Table A","LGPS EW Additional Pension post-2014 1 March 2019","2023-09-26","2023-10-02","Issued"]
["x-712","LGPS_EW","post 2014","Added pension","Additional pension - lump sum contributions - Females  (purchase of additional pension after 1 April 2014)","Female","Age at payment",0,712,"0-712","Table B","LGPS EW Additional Pension post-2014 1 March 2019","2023-09-26","2023-10-02","Issued"]
[{"$f":"HYPERLINK(\"#'x-\"&I70 & \"'!A1\",\"x-\"&I70)","v":"x-713"},"LGPS_EW","post 2014","Added pension","Additional pension - Regular monthly contributions - Males with NPA 65 (purchase of additional pension after 1 April 2014)","Male","Age at first contribution",0,713,"0-713","Table C","LGPS EW Additional Pension post-2014 1 March 2019","2023-09-26","2023-10-02","Issued"]
["x-714","LGPS_EW","post 2014","Added pension","Additional pension - Regular monthly contributions - Females with NPA 65 (purchase of additional pension after 1 April 2014)","Female","Age at first contribution",0,714,"0-714","Table D","LGPS EW Additional Pension post-2014 1 March 2019","2023-09-26","2023-10-02","Issued"]
["x-715","LGPS_EW","post 2014","Added pension","Additional pension - Regular monthly contributions - Males with NPA 66 (purchase of additional pension after 1 April 2014)","Male","Age at first contribution",0,715,"0-715","Table E","LGPS EW Additional Pension post-2014 1 March 2019","2023-09-26","2023-10-02","Issued"]
["x-716","LGPS_EW","post 2014","Added pension","Additional pension - Regular monthly contributions - Females with NPA 66 (purchase of additional pension after 1 April 2014)","Female","Age at first contribution",0,716,"0-716","Table F","LGPS EW Additional Pension post-2014 1 March 2019","2023-09-26","2023-10-02","Issued"]
["x-717","LGPS_EW","post 2014","Added pension","Additional pension - Regular monthly contributions - Males with NPA 67 (purchase of additional pension after 1 April 2014)","Male","Age at first contribution",0,717,"0-717","Table G","LGPS EW Additional Pension post-2014 1 March 2019","2023-09-26","2023-10-02","Issued"]
["x-718","LGPS_EW","post 2014","Added pension","Additional pension - Regular monthly contributions - Females with NPA 67 (purchase of additional pension after 1 April 2014)","Female","Age at first contribution",0,718,"0-718","Table H","LGPS EW Additional Pension post-2014 1 March 2019","2023-09-26","2023-10-02","Issued"]
["x-719","LGPS_EW","post 2014","Added pension","Additional pension - Regular monthly contributions - Males with NPA 68 (purchase of additional pension after 1 April 2014)","Male","Age at first contribution",0,719,"0-719","Table I","LGPS EW Additional Pension post-2014 1 March 2019","2023-09-26","2023-10-02","Issued"]
["x-720","LGPS_EW","post 2014","Added pension","Additional pension - Regular monthly contributions - Females with NPA 68 (purchase of additional pension after 1 April 2014)","Female","Age at first contribution",0,720,"0-720","Table J","LGPS EW Additional Pension post-2014 1 March 2019","2023-09-26","2023-10-02","Issued"]
["x-801","LGPS_EW","All","AVC to transfer credits","Factors for the conversion of accumulated AVCs to transfer credits","Male & Female","Age last birthday at relevant date",0,801,"0-801","Table 4.1","LGPS EW Reg 66(8) conversion of accumulated AVC to transfer credits 5 May 2021","2023-09-26","2023-10-02","Issued"]
["x-802","LGPS_EW","All","AVC to AP","Use of accumulated AVCs for additional pension (pre-14) - Amount of additional annual pension for every £100 of accumulated AVCs - Retirements in normal health","Male & Female","Age at date member becomes entitled to an immediate pension or, if later, the date of election under Regulation 26(4) in years and complete months",0,802,"0-802","Table 1","LGPS EW Use of accumulated AVCs to provide additional pension pre-14 14 April 2016","2023-09-26","2023-10-02","Issued"]
["x-803","LGPS_EW","All","AVC to AP","Use of accumulated AVCs for additional pension (pre-14) - Amount of additional annual pension for every £100 of accumulated AVCs - Retirements in ill health","Male & Female","Age at date member becomes entitled to an immediate pension or, if later, the date of election under Regulation 26(4) in years and complete months",0,803,"0-803","Table 2","LGPS EW Use of accumulated AVCs to provide additional pension pre-14 14 April 2016","2023-09-26","2023-10-02","Issued"]
["x-806","LGPS_EW","All","AVC to AP","Use of accumulated AVCs for additional pension (post-14) - Amount of additional annual pension for every £100 of accumulated AVCs - Retirements in normal health","Male & Female","Age at date member draws benefits from the AVC arrangement under Regulation 17(7), in years and complete months ",0,806,"0-806","Table 1","LGPS EW Use of accumulated AVCs to provide additional pension post-14 14 April 2016","2023-09-26","2023-10-02","Issued"]
["x-807","LGPS_EW","All","AVC to AP","Use of accumulated AVCs for additional pension (post-14) - Amount of additional annual pension for every £100 of accumulated AVCs - Retirements in ill health","Male & Female","Age at date member draws benefits from the AVC arrangement under Regulation 17(7), in years and complete months ",0,807,"0-807","Table 2","LGPS EW Use of accumulated AVCs to provide additional pension post-14 14 April 2016","2023-09-26","2023-10-02","Issued"]
["x-808","LGPS_EW","All","Additional survivor benefits","Cost of one year’s additional survivor benefits - Additional survivor benefit contribution rate - cost expressed as a percentage of full time equivalent salary - male member with female partner","Male","Age at first contribution",0,808,"0-808","Table A","LGPS EW Purchase of Additional Survivor Benefits 5 May 2021","2023-09-26","2023-10-02","Issued"]
["x-809","LGPS_EW","All","Additional survivor benefits","Cost of one year’s additional survivor benefits - Additional survivor benefit contribution rate - cost expressed as a percentage of full time equivalent salary - female member with male partner","Female","Age at first contribution",0,809,"0-809","Table B","LGPS EW Purchase of Additional Survivor Benefits 5 May 2021","2023-09-26","2023-10-02","Issued"]
["x-810","LGPS_EW","All","Additional survivor benefits","Cost of one year’s additional survivor benefits - Additional survivor benefit contribution rate - cost expressed as a percentage of full time equivalent salary - male member with male partner","Male","Age at first contribution",0,810,"0-810","Table C","LGPS EW Purchase of Additional Survivor Benefits 5 May 2021","2023-09-26","2023-10-02","Issued"]
["x-811","LGPS_EW","All","Additional survivor benefits","Cost of one year’s additional survivor benefits - Additional survivor benefit contribution rate - cost expressed as a percentage of full time equivalent salary - female member with female partner","Female","Age at first contribution",0,811,"0-811","Table D","LGPS EW Purchase of Additional Survivor Benefits 5 May 2021","2023-09-26","2023-10-02","Issued"]

{"sheet":"Summary - LGPS_EW","index":4,"n_rows":224,"n_cols":5,"rows_kept":224,"cut":false,"hidden":true,"merged":[]}
["Government Actuary's Department"]
[{"$f":"IF(TITLE=\"> Enter workbook title here\",\"Enter workbook title in Cover sheet\",TITLE)","v":"Local Government Pension Scheme (LGPS) - Consolidated Factor Spreadsheet"}]
["Summary of Factors "]
[{"$f":"CELL(\"filename\",A1)","v":"C:\\Users\\jayne.wiberg\\AppData\\Local\\Microsoft\\Windows\\INetCache\\Content.Outlook\\HISDCY4X\\[LGPS EW Consolidated Factors 2023-04 v2.xlsm]Summary - LGPS_EW"}]
[]
[]
[null,null,null,null,"x=0"]
[null,"LGPS_EW",null,null,2015]
[]
[null,"100 Series - Club Transfer"]
[null,"x-",101]
[null,"x-",102]
[null,"x-",103]
[null,"x-",104]
[null,"x-",105]
[null,"x-",106]
[null,"x-",107]
[null,"x-",108]
[null,"x-",109]
[null,"x-",110]
[null,"x-",111]
[null,"x-",112]
[null,"x-",113]
[null,"x-",114]
[null,"x-",115]
[null,"x-",116]
[null,"x-",117]
[null,"x-",118]
[null,"x-",119]
[null,"x-",120]
[null,"x-",121]
[null,"x-",122]
[null,"x-",123]
[null,"x-",124]
[null,"x-",125]
[]
[null,"200 Series - Non Club Transfers"]
[null,"x-",201]
[null,"x-",202]
[null,"x-",203]
[null,"x-",204]
[null,"x-",205]
[null,"x-",206]
[null,"x-",207]
[null,"x-",208]
[null,"x-",209]
[null,"x-",210]
[null,"x-",211]
[null,"x-",212]
[null,"x-",213]
[null,"x-",214]
[null,"x-",215]
[null,"x-",216]
[null,"x-",217]
[null,"x-",218]
[null,"x-",219]
[null,"x-",220]
[null,"x-",221]
[null,"x-",222]
[null,"x-",223]
[null,"x-",224]
[null,"x-",225]
[]
[null,"300 Series - Pension Sharing on divorce"]
[null,"x-",301]
[null,"x-",302]
[null,"x-",303]
[null,"x-",304]
[null,"x-",305]
[null,"x-",306]
[null,"x-",307]
[null,"x-",308]
[null,"x-",309]
[null,"x-",310]
[null,"x-",311]
[null,"x-",312]
[null,"x-",313]
[null,"x-",314]
[null,"x-",315]
[null,"x-",316]
[null,"x-",317]
[null,"x-",318]
[null,"x-",319]
[null,"x-",320]
[null,"x-",321]
[null,"x-",322]
[null,"x-",323]
[null,"x-",324]
[null,"x-",325]
[]
[null,"400 Series - Early or Late Retirement"]
[null,"x-",401]
[null,"x-",402]
[null,"x-",403]
[null,"x-",404]
[null,"x-",405]
[null,"x-",406]
[null,"x-",407]
[null,"x-",408]
[null,"x-",409]
[null,"x-",410]
[null,"x-",411]
[null,"x-",412]
[null,"x-",413]
[null,"x-",414]
[null,"x-",415]
[null,"x-",416]
[null,"x-",417]
[null,"x-",418]
[null,"x-",419]
[null,"x-",420]
[null,"x-",421]
[null,"x-",422]
[null,"x-",423]
[null,"x-",424]
[null,"x-",425]
[]
[null,"500 Series - Commutation"]
[null,"x-",501]
[null,"x-",502]
[null,"x-",503]
[null,"x-",504]
[null,"x-",505]
[null,"x-",506]
[null,"x-",507]
[null,"x-",508]
[null,"x-",509]
[null,"x-",510]
[null,"x-",511]
[null,"x-",512]
[null,"x-",513]
[null,"x-",514]
[null,"x-",515]
[null,"x-",516]
[null,"x-",517]
[null,"x-",518]
[null,"x-",519]
[null,"x-",520]
[null,"x-",521]
[null,"x-",522]
[null,"x-",523]
[null,"x-",524]
[null,"x-",525]
[]
[null,"600 Series - Scheme Pays"]
[null,"x-",601]
[null,"x-",602]
[null,"x-",603]
[null,"x-",604]
[null,"x-",605]
[null,"x-",606]
[null,"x-",607]
[null,"x-",608]
[null,"x-",609]
[null,"x-",610]
[null,"x-",611]
[null,"x-",612]
[null,"x-",613]
[null,"x-",614]
[null,"x-",615]
[null,"x-",616]
[null,"x-",617]
[null,"x-",618]
[null,"x-",619]
[null,"x-",620]
[null,"x-",621]
[null,"x-",622]
[null,"x-",623]
[null,"x-",624]
[null,"x-",625]
[]
[null,"700 Series - Additional Benefits or Additional Contributions"]
[null,"x-",701]
[null,"x-",702]
[null,"x-",703]
[null,"x-",704]
[null,"x-",705]
[null,"x-",706]
[null,"x-",707]
[null,"x-",708]
[null,"x-",709]
[null,"x-",710]
[null,"x-",711]
[null,"x-",712]
[null,"x-",713]
[null,"x-",714]
[null,"x-",715]
[null,"x-",716]
[null,"x-",717]
[null,"x-",718]
[null,"x-",719]
[null,"x-",720]
[null,"x-",721]
[null,"x-",722]
[null,"x-",723]
[null,"x-",724]
[null,"x-",725]
[]
[null,"800 Series - Other Scheme Specific"]
[null,"x-",801]
[null,"x-",802]
[null,"x-",803]
[null,"x-",804]
[null,"x-",805]
[null,"x-",806]
[null,"x-",807]
[null,"x-",808]
[null,"x-",809]
[null,"x-",810]
[null,"x-",811]
[null,"x-",812]
[null,"x-",813]
[null,"x-",814]
[null,"x-",815]
[null,"x-",816]
[null,"x-",817]
[null,"x-",818]
[null,"x-",819]
[null,"x-",820]
[null,"x-",821]
[null,"x-",822]
[null,"x-",823]
[null,"x-",824]
[null,"x-",825]

{"sheet":"x-Series Number","index":5,"n_rows":25,"n_cols":2,"rows_kept":25,"cut":false,"hidden":true,"merged":[]}
["Government Actuary's Department"]
[{"$f":"IF(TITLE=\"> Enter workbook title here\",\"Enter workbook title in Cover sheet\",TITLE)","v":"Local Government Pension Scheme (LGPS) - Consolidated Factor Spreadsheet"}]
[{"$f":"TABLE_FACTOR_TYPE&\" - x-\"&TABLE_SERIES_NUMBER","v":"Enter the factor type (which should be consistent with the series header types found on the summary sheet (eg early or late retirement) - x-Enter series number (this reflects the number in the relevant series eg if it’s the first ER/LR factor then it would be \"401\")"}]
[{"$f":"CELL(\"filename\",A1)","v":"C:\\Users\\jayne.wiberg\\AppData\\Local\\Microsoft\\Windows\\INetCache\\Content.Outlook\\HISDCY4X\\[LGPS EW Consolidated Factors 2023-04 v2.xlsm]x-Series Number"}]
[]
["Data Item","Factor Table Information"]
["Client","Enter the client name eg NHSPS_EW"]
["Section","Enter the section name eg NHSPS 2015"]
["Factor Type","Enter the factor type (which should be consistent with the series header types found on the summary sheet (eg early or late retirement)"]
["Description","Enter a description of the factor (eg use description from factor table in guidance)"]
["Gender","Enter either \"unisex\" or \"m and f\""]
["Factor Age/Period Definition","Enter in age definition"]
["Section Number","Enter section number (this relates to the number used to identify the scheme section - see top of summary tab for section number)"]
["Series Number","Enter series number (this reflects the number in the relevant series eg if it’s the first ER/LR factor then it would be \"401\")"]
["Table Reference","Enter table number (this is the section number plus the series number so we can identify the section and factor type eg if the section number for NHSPS 2015 was 0 and the factor was the first in the ER/LR factor series then this would be \"0-401\" entered here."]
["Table Reference in Guidance","Enter the table reference from the guidance notes"]
["Related Factor Table Reference (where the factor uses the same table as another factor in this spreadsheet)","If the factor table on this sheet is the same as another factor in the spreadsheet. Then enter that table reference here eg 0-.201. If this factor table is unique then put \"n/a\"."]
["Date Factors Issued to Client","Enter the date the factors are issued to the client"]
["Date Factors Implemented (if known)","Enter the date the factors are implemented "]
["Factor Status","Enter whether table is inforce, withdrawn, refer to gad etc"]
[]
[null,{"$f":"HYPERLINK(\"#'Factor List'!A1\",\"Back to Factor List\")","v":"Back to Factor List"}]
[]
[]
["Copy the relevant factor table and foot notes here. Unisex or male factor table in this grey box."]

{"sheet":"AnnGenHiddenLists","index":6,"n_rows":190,"n_cols":3,"rows_kept":190,"cut":false,"hidden":true,"merged":[]}
["DO NOT REMOVE WORKSHEET"]
[]
["BaseTablesList",null,"ImprovementsList"]
["PCFA00",null,"CMI2016F-02-1pt25"]
["PCMA00",null,"CMI2016F-07-1pt5"]
["PFA80",null,"CMI2016M-02-1pt25"]
["PFA92",null,"CMI2016M-07-1pt5"]
["PFA92 - 08",null,"CMI2017F-07-1pt5"]
["PFA92-10",null,"CMI2017M-07-1pt5"]
["PMA80",null,"Long Cohort"]
["PMA92",null,"Medium Cohort"]
["PMA92 - 08",null,"PFA80imp"]
["PMA92-10",null,"PFA92"]
["PNFA00",null,"PMA80imp"]
["PNFA00-06",null,"PMA92"]
["PNFA00-08",null,"S3-UKF2016imp"]
["PNFA00-10",null,"S3-UKM2016imp"]
["PNMA00",null,"Short Cohort"]
["PNMA00-06",null,"SMPI-2018imp"]
["PNMA00-08",null,"UKF2004imp"]
["PNMA00-10",null,"UKF2006imp"]
["S1DFA",null,"UKF2006imp_HLE"]
["S1DFA-06",null,"UKF2006imp_LLE"]
["S1DFA-08",null,"UKF2008imp"]
["S1DFA-10",null,"UKF2010imp"]
["S1DFA-12",null,"UKF2012imp"]
["S1DFA-14",null,"UKF2014imp"]
["S1DFA-16",null,"UKf2016HLEimp"]
["S1DFA-L",null,"UKF2016imp"]
["S1DFA-L-06",null,"UKf2016LLEimp"]
["S1DFA-L-08",null,"UKM2004imp"]
["S1DFA-L-10",null,"UKM2006imp"]
["S1DFA-L-12",null,"UKM2006imp_HLE"]
["S1IFA",null,"UKM2006imp_LLE"]
["S1IFA-06",null,"UKM2008imp"]
["S1IFA-08",null,"UKM2010imp"]
["S1IFA-10",null,"UKM2012imp"]
["S1IFA-12",null,"UKM2014imp"]
["S1IFA-14",null,"UKm2016HLEimp"]
["S1IFA-16",null,"UKM2016imp"]
["S1IFA-STSS-16",null,"UKm2016LLEimp"]
["S1IFA-TPS-16",null,"None"]
["S1IMA"]
["S1IMA-06"]
["S1IMA-08"]
["S1IMA-10"]
["S1IMA-12"]
["S1IMA-14"]
["S1IMA-16"]
["S1IMA-STSS-16"]
["S1IMA-TPS-16"]
["S1NFA"]
["S1NFA-06"]
["S1NFA-08"]
["S1NFA-10"]
["S1NFA-12"]
["S1NFA-14"]
["S1NFA-16"]
["S1NFA-L"]
["S1NFA-L-06"]
["S1NFA-L-08"]
["S1NFA-L-10"]
["S1NFA-L-12"]
["S1NFA-L-14"]
["S1NFA-L-16"]
["S1NFA-L-STSS"]
["S1NFA-L-STSS-06"]
["S1NFA-L-STSS-08"]
["S1NFA-L-STSS-10"]
["S1NFA-L-STSS-12"]
["S1NFA-L-STSS-14"]
["S1NFA-L-STSS-16"]
["S1NFA-L-TPS"]
["S1NFA-L-TPS-06"]
["S1NFA-L-TPS-08"]
["S1NFA-L-TPS-10"]
["S1NFA-L-TPS-12"]
["S1NFA-L-TPS-14"]
["S1NFA-L-TPS-16"]
["S1NMA"]
["S1NMA-06"]
["S1NMA-08"]
["S1NMA-10"]
["S1NMA-12"]
["S1NMA-14"]
["S1NMA-16"]
["S1NMA-L"]
["S1NMA-L-06"]
["S1NMA-L-08"]
["S1NMA-L-10"]
["S1NMA-L-12"]
["S1NMA-L-14"]
["S1NMA-L-16"]
["S1PFA"]
["S1PFA-06"]
["S1PFA-08"]
["S1PFA-10"]
["S1PFA-12"]
["S1PFA-14"]
["S1PFA-16"]
["S1PMA"]
["S1PMA-06"]
["S1PMA-08"]
["S1PMA-10"]
["S1PMA-12"]
["S1PMA-14"]
["S1PMA-16"]
["S2DFA"]
["S2DFA-12"]
["S2DFA-14"]
["S2DFA-16"]
["S2DFL"]
["S2DFL-12"]
["S2DFL-16"]
["S2IFA"]
["S2IFA-12"]
["S2IFA-14"]
["S2IFA-16"]
["S2IMA"]
["S2IMA-12"]
["S2IMA-14"]
["S2IMA-16"]
["S2NFA"]
["S2NFA-12"]
["S2NFA-14"]
["S2NFA-16"]
["S2NFA-CMI"]
["S2NMA"]
["S2NMA_L-16"]
["S2NMA-12 "]
["S2NMA-14"]
["S2NMA-16"]
["S2NMA-CMI"]
["S2PFA"]
["S2PFA-12"]
["S2PFA-14"]
["S2PFA-16"]
["S2PFL"]
["S2PFL-12"]
["S2PFL-16"]
["S2PMA"]
["S2PMA-12"]
["S2PMA-14"]
["S2PMA-16"]
["S2PML"]
["S2PML-12"]
["S2PML-16"]
["S3DFA"]
["S3DFA_L"]
["S3DFA_VL"]
["S3DFL"]
["S3DMA"]
["S3DML"]
["S3IFA"]
["S3IMA"]
["S3NFA"]
["S3NFA_H"]
["S3NFA_L"]
["S3NFA_M"]
["S3NFA_VL"]
["S3NMA"]
["S3NMA_H"]
["S3NMA_L"]
["S3NMA_M"]
["S3NMA_VL"]
["S3PFA"]
["S3PFA_H"]
["S3PFA_L"]
["S3PFA_M"]
["S3PFA_VL"]
["S3PFL"]
["S3PMA"]
["S3PMA_H"]
["S3PMA_L"]
["S3PMA_M"]
["S3PMA_VL"]
["S3PML"]
["SMPI-2018"]
["UKF"]
["UKF2004"]
["UKF2006"]
["UKF2008"]
["UKF2010"]
["UKF2012"]
["UKM"]
["UKM2004"]
["UKM2006"]
["UKM2008"]
["UKM2010"]
["UKM2012"]

{"sheet":"Club 2023 Tables 1&2","index":7,"n_rows":40,"n_cols":4,"rows_kept":40,"cut":false,"hidden":false,"merged":[]}
["Government Actuary's Department"]
[{"$f":"IF(TITLE=\"> Enter workbook title here\",\"Enter workbook title in Cover sheet\",TITLE)","v":"Local Government Pension Scheme (LGPS) - Consolidated Factor Spreadsheet"}]
["CETV - Club 2023 Tables 1&2"]
[]
[]
["Data Item","Factor Table Information"]
["Scheme","LGPS_EW"]
["Section","Club"]
["Factor Type","CETV"]
["Description","Club transfer factors for valuing immediate benefit payment "]
["Gender","Unisex"]
["Factor Age/Period Definition","Age last birthday at relevant date"]
["Section Number",0]
["Series Number",102]
["Table Reference","0-102"]
["Table Reference in Guidance","Club 2023 Tables 1 and 2 (partial table - copies of Club factors from age 60 onwards only)"]
["Related Factor Guidance Note","LGPS EW Individual Transfers 8 April 2020"]
["Date Factors Issued to Client","2023-08-31"]
["Date Factors Implemented (if known)","2023-10-01"]
["Factor Status","Issued"]
[]
[null,{"$f":"HYPERLINK(\"#'Factor List'!A1\",\"Back to Factor List\")","v":"Back to Factor List"}]
[]
[]
["Age last birthday at relevant date","Gross Pension of £1 per annum","Lump Sum of £1","Surviving Partner's Pension of £1 pa"]
[60,21.87,1,2.12]
[61,21.25,1,2.13]
[62,20.63,1,2.14]
[63,20.010000000000002,1,2.15]
[64,19.38,1,2.15]
[65,18.75,1,2.16]
[66,18.11,1,2.16]
[67,17.47,1,2.16]
[68,16.829999999999998,1,2.16]
[69,16.190000000000001,1,2.15]
[70,15.54,1,2.15]
[71,14.9,1,2.14]
[72,14.27,1,2.13]
[73,13.63,1,2.12]
[74,13.01,1,2.1]

{"sheet":"Club 2023 Table 3","index":8,"n_rows":84,"n_cols":4,"rows_kept":84,"cut":false,"hidden":false,"merged":[]}
["Government Actuary's Department"]
[{"$f":"IF(TITLE=\"> Enter workbook title here\",\"Enter workbook title in Cover sheet\",TITLE)","v":"Local Government Pension Scheme (LGPS) - Consolidated Factor Spreadsheet"}]
["CETV - Club 2023 Table 3"]
[]
[]
["Data Item","Factor Table Information"]
["Scheme","LGPS_EW"]
["Section","Club"]
["Factor Type","CETV"]
["Description","Club transfer factors based on Normal Pension Age of 65"]
["Gender","Unisex"]
["Factor Age/Period Definition","Age last birthday at relevant date"]
["Section Number",0]
["Series Number",103]
["Table Reference","x-103"]
["Table Reference in Guidance","Club 2023 Table 3"]
["Related Factor Guidance Note","LGPS EW Individual Transfers 8 April 2020"]
["Date Factors Issued to Client","2023-08-31"]
["Date Factors Implemented (if known)","2023-10-01"]
["Factor Status","Issued"]
[]
[null,{"$f":"HYPERLINK(\"#'Factor List'!A1\",\"Back to Factor List\")","v":"Back to Factor List"}]
[]
[]
["Age last birthday at relevant date","Gross Pension of £1 per annum","Lump Sum of £1","Surviving Partner's Pension of £1 pa"]
[16,9.1300000000000008,0.43,1.35]
[17,9.26,0.43,1.38]
[18,9.4,0.44,1.4]
[19,9.5299999999999994,0.45,1.42]
[20,9.67,0.45,1.44]
[21,9.81,0.46,1.47]
[22,9.9499999999999993,0.47,1.49]
[23,10.1,0.48,1.51]
[24,10.25,0.49,1.54]
[25,10.39,0.49,1.56]
[26,10.54,0.5,1.58]
[27,10.7,0.51,1.61]
[28,10.85,0.52,1.63]
[29,11.01,0.53,1.65]
[30,11.17,0.54,1.68]
[31,11.33,0.55000000000000004,1.7]
[32,11.5,0.56000000000000005,1.72]
[33,11.67,0.56000000000000005,1.75]
[34,11.84,0.56999999999999995,1.77]
[35,12.01,0.57999999999999996,1.79]
[36,12.19,0.59,1.82]
[37,12.36,0.6,1.84]
[38,12.55,0.61,1.86]
[39,12.73,0.63,1.88]
[40,12.92,0.64,1.9]
[41,13.11,0.65,1.93]
[42,13.3,0.66,1.95]
[43,13.5,0.67,1.97]
[44,13.7,0.68,1.99]
[45,13.91,0.69,2.0099999999999998]
[46,14.11,0.71,2.02]
[47,14.33,0.72,2.04]
[48,14.54,0.73,2.06]
[49,14.77,0.74,2.08]
[50,14.99,0.76,2.09]
[51,15.22,0.77,2.11]
[52,15.46,0.78,2.12]
[53,15.7,0.8,2.13]
[54,15.95,0.81,2.14]
[55,16.2,0.83,2.15]
[56,16.46,0.84,2.16]
[57,16.73,0.86,2.17]
[58,17.010000000000002,0.88,2.1800000000000002]
[59,17.29,0.89,2.1800000000000002]
[60,17.59,0.91,2.1800000000000002]
[61,17.89,0.93,2.1800000000000002]
[62,18.21,0.95,2.1800000000000002]
[63,18.54,0.97,2.17]
[64,18.89,0.99,2.16]
[65,18.75,1,2.16]
[66,18.11,1,2.16]
[67,17.47,1,2.16]
[68,16.829999999999998,1,2.16]
[69,16.190000000000001,1,2.15]
[70,15.54,1,2.15]
[71,14.9,1,2.14]
[72,14.27,1,2.13]
[73,13.63,1,2.12]
[74,13.01,1,2.1]

{"sheet":"Club 2023 Table 4","index":9,"n_rows":84,"n_cols":4,"rows_kept":84,"cut":false,"hidden":false,"merged":[]}
["Government Actuary's Department"]
[{"$f":"IF(TITLE=\"> Enter workbook title here\",\"Enter workbook title in Cover sheet\",TITLE)","v":"Local Government Pension Scheme (LGPS) - Consolidated Factor Spreadsheet"}]
["CETV - Club 2023 Table 4"]
[]
[]
["Data Item","Factor Table Information"]
["Scheme","LGPS_EW"]
["Section","Club"]
["Factor Type","CETV"]
["Description","Club transfer factors based on Normal Pension Age of 66"]
["Gender","Unisex"]
["Factor Age/Period Definition","Age last birthday at relevant date"]
["Section Number",0]
["Series Number",104]
["Table Reference",{"$f":"\"x-\"&B14","v":"x-104"}]
["Table Reference in Guidance","Club 2023 Table 4"]
["Related Factor Guidance Note","LGPS EW Individual Transfers 8 April 2020"]
["Date Factors Issued to Client","2023-08-31"]
["Date Factors Implemented (if known)","2023-10-01"]
["Factor Status","Issued"]
[]
[null,{"$f":"HYPERLINK(\"#'Factor List'!A1\",\"Back to Factor List\")","v":"Back to Factor List"}]
[]
[]
["Age last birthday at relevant date","Gross Pension of £1 per annum","Lump Sum of £1","Surviving Partner's Pension of £1 pa"]
[16,8.7100000000000009,0.42,1.36]
[17,8.84,0.42,1.38]
[18,8.9600000000000009,0.43,1.4]
[19,9.09,0.44,1.43]
[20,9.2200000000000006,0.45,1.45]
[21,9.36,0.45,1.47]
[22,9.49,0.46,1.5]
[23,9.6300000000000008,0.47,1.52]
[24,9.77,0.48,1.54]
[25,9.91,0.48,1.57]
[26,10.050000000000001,0.49,1.59]
[27,10.19,0.5,1.62]
[28,10.34,0.51,1.64]
[29,10.49,0.52,1.66]
[30,10.64,0.53,1.69]
[31,10.79,0.53,1.71]
[32,10.95,0.54,1.73]
[33,11.11,0.55000000000000004,1.76]
[34,11.27,0.56000000000000005,1.78]
[35,11.43,0.56999999999999995,1.8]
[36,11.6,0.57999999999999996,1.83]
[37,11.77,0.59,1.85]
[38,11.94,0.6,1.87]
[39,12.11,0.61,1.89]
[40,12.29,0.62,1.92]
[41,12.47,0.63,1.94]
[42,12.65,0.64,1.96]
[43,12.84,0.66,1.98]
[44,13.03,0.67,2]
[45,13.22,0.68,2.02]
[46,13.42,0.69,2.04]
[47,13.62,0.7,2.06]
[48,13.82,0.72,2.0699999999999998]
[49,14.03,0.73,2.09]
[50,14.25,0.74,2.11]
[51,14.46,0.75,2.12]
[52,14.69,0.77,2.13]
[53,14.91,0.78,2.15]
[54,15.15,0.8,2.16]
[55,15.39,0.81,2.17]
[56,15.63,0.83,2.1800000000000002]
[57,15.88,0.84,2.19]
[58,16.14,0.86,2.19]
[59,16.41,0.87,2.2000000000000002]
[60,16.690000000000001,0.89,2.2000000000000002]
[61,16.98,0.91,2.2000000000000002]
[62,17.28,0.93,2.19]
[63,17.59,0.95,2.19]
[64,17.91,0.97,2.1800000000000002]
[65,18.260000000000002,0.99,2.17]
[66,18.11,1,2.16]
[67,17.47,1,2.16]
[68,16.829999999999998,1,2.16]
[69,16.190000000000001,1,2.15]
[70,15.54,1,2.15]
[71,14.9,1,2.14]
[72,14.27,1,2.13]
[73,13.63,1,2.12]
[74,13.01,1,2.1]

{"sheet":"Club 2023 Table 5","index":10,"n_rows":84,"n_cols":4,"rows_kept":84,"cut":false,"hidden":false,"merged":[]}
["Government Actuary's Department"]
[{"$f":"IF(TITLE=\"> Enter workbook title here\",\"Enter workbook title in Cover sheet\",TITLE)","v":"Local Government Pension Scheme (LGPS) - Consolidated Factor Spreadsheet"}]
["CETV - Club 2023 Table 5"]
[]
[]
["Data Item","Factor Table Information"]
["Scheme","LGPS_EW"]
["Section","Club"]
["Factor Type","CETV"]
["Description","Club transfer factors based on Normal Pension Age of 67"]
["Gender","Unisex"]
["Factor Age/Period Definition","Age last birthday at relevant date"]
["Section Number",0]
["Series Number",105]
["Table Reference",{"$f":"\"x-\"&B14","v":"x-105"}]
["Table Reference in Guidance","Club 2023 Table 5"]
["Related Factor Guidance Note","LGPS EW Individual Transfers 8 April 2020"]
["Date Factors Issued to Client","2023-08-31"]
["Date Factors Implemented (if known)","2023-10-01"]
["Factor Status","Issued"]
[]
[null,{"$f":"HYPERLINK(\"#'Factor List'!A1\",\"Back to Factor List\")","v":"Back to Factor List"}]
[]
[]
["Age last birthday at relevant date","Gross Pension of £1 per annum","Lump Sum of £1","Surviving Partner's Pension of £1 pa"]
[16,8.3000000000000007,0.41,1.37]
[17,8.42,0.42,1.39]
[18,8.5399999999999991,0.42,1.41]
[19,8.66,0.43,1.43]
[20,8.7799999999999994,0.44,1.46]
[21,8.91,0.44,1.48]
[22,9.0399999999999991,0.45,1.5]
[23,9.17,0.46,1.53]
[24,9.3000000000000007,0.47,1.55]
[25,9.43,0.47,1.58]
[26,9.56,0.48,1.6]
[27,9.6999999999999993,0.49,1.62]
[28,9.84,0.5,1.65]
[29,9.98,0.51,1.67]
[30,10.119999999999999,0.52,1.7]
[31,10.27,0.52,1.72]
[32,10.41,0.53,1.74]
[33,10.56,0.54,1.77]
[34,10.72,0.55000000000000004,1.79]
[35,10.87,0.56000000000000005,1.82]
[36,11.03,0.56999999999999995,1.84]
[37,11.18,0.57999999999999996,1.86]
[38,11.35,0.59,1.88]
[39,11.51,0.6,1.91]
[40,11.68,0.61,1.93]
[41,11.85,0.62,1.95]
[42,12.02,0.63,1.97]
[43,12.19,0.64,1.99]
[44,12.37,0.65,2.0099999999999998]
[45,12.55,0.66,2.0299999999999998]
[46,12.74,0.68,2.0499999999999998]
[47,12.93,0.69,2.0699999999999998]
[48,13.12,0.7,2.09]
[49,13.32,0.71,2.11]
[50,13.52,0.73,2.12]
[51,13.72,0.74,2.14]
[52,13.93,0.75,2.15]
[53,14.14,0.77,2.17]
[54,14.36,0.78,2.1800000000000002]
[55,14.59,0.79,2.19]
[56,14.82,0.81,2.2000000000000002]
[57,15.05,0.82,2.21]
[58,15.3,0.84,2.21]
[59,15.55,0.86,2.2200000000000002]
[60,15.81,0.87,2.2200000000000002]
[61,16.079999999999998,0.89,2.2200000000000002]
[62,16.36,0.91,2.21]
[63,16.649999999999999,0.93,2.21]
[64,16.96,0.95,2.2000000000000002]
[65,17.28,0.97,2.1800000000000002]
[66,17.62,0.99,2.17]
[67,17.47,1,2.16]
[68,16.829999999999998,1,2.16]
[69,16.190000000000001,1,2.15]
[70,15.54,1,2.15]
[71,14.9,1,2.14]
[72,14.27,1,2.13]
[73,13.63,1,2.12]
[74,13.01,1,2.1]

{"sheet":"Club 2023 Table 6","index":11,"n_rows":84,"n_cols":4,"rows_kept":84,"cut":false,"hidden":false,"merged":[]}
["Government Actuary's Department"]
[{"$f":"IF(TITLE=\"> Enter workbook title here\",\"Enter workbook title in Cover sheet\",TITLE)","v":"Local Government Pension Scheme (LGPS) - Consolidated Factor Spreadsheet"}]
["CETV - Club 2023 Table 6"]
[]
[]
["Data Item","Factor Table Information"]
["Scheme","LGPS_EW"]
["Section","Club"]
["Factor Type","CETV"]
["Description","Club transfer factors based on Normal Pension Age of 68"]
["Gender","Unisex"]
["Factor Age/Period Definition","Age last birthday at relevant date"]
["Section Number",0]
["Series Number",106]
["Table Reference","x-106"]
["Table Reference in Guidance","Club 2023 Table 6"]
["Related Factor Guidance Note","LGPS EW Individual Transfers 8 April 2020"]
["Date Factors Issued to Client","2023-08-31"]
["Date Factors Implemented (if known)","2023-10-01"]
["Factor Status","Issued"]
[]
[null,{"$f":"HYPERLINK(\"#'Factor List'!A1\",\"Back to Factor List\")","v":"Back to Factor List"}]
[]
[]
["Age last birthday at relevant date","Gross Pension of £1 per annum","Lump Sum of £1","Surviving Partner's Pension of £1 pa"]
[16,7.9,0.4,1.37]
[17,8.01,0.41,1.4]
[18,8.1199999999999992,0.41,1.42]
[19,8.24,0.42,1.44]
[20,8.35,0.43,1.47]
[21,8.4700000000000006,0.43,1.49]
[22,8.59,0.44,1.51]
[23,8.7100000000000009,0.45,1.54]
[24,8.84,0.46,1.56]
[25,8.9600000000000009,0.46,1.59]
[26,9.09,0.47,1.61]
[27,9.2200000000000006,0.48,1.64]
[28,9.35,0.49,1.66]
[29,9.48,0.5,1.68]
[30,9.61,0.5,1.71]
[31,9.75,0.51,1.73]
[32,9.89,0.52,1.76]
[33,10.029999999999999,0.53,1.78]
[34,10.17,0.54,1.8]
[35,10.32,0.55000000000000004,1.83]
[36,10.46,0.56000000000000005,1.85]
[37,10.61,0.56999999999999995,1.87]
[38,10.76,0.57999999999999996,1.9]
[39,10.92,0.59,1.92]
[40,11.08,0.6,1.94]
[41,11.23,0.61,1.97]
[42,11.4,0.62,1.99]
[43,11.56,0.63,2.0099999999999998]
[44,11.73,0.64,2.0299999999999998]
[45,11.9,0.65,2.0499999999999998]
[46,12.07,0.66,2.0699999999999998]
[47,12.25,0.67,2.09]
[48,12.43,0.68,2.11]
[49,12.61,0.7,2.12]
[50,12.8,0.71,2.14]
[51,12.99,0.72,2.16]
[52,13.19,0.74,2.17]
[53,13.39,0.75,2.1800000000000002]
[54,13.6,0.76,2.2000000000000002]
[55,13.81,0.78,2.21]
[56,14.02,0.79,2.2200000000000002]
[57,14.24,0.81,2.23]
[58,14.47,0.82,2.23]
[59,14.71,0.84,2.2400000000000002]
[60,14.95,0.85,2.2400000000000002]
[61,15.21,0.87,2.2400000000000002]
[62,15.47,0.89,2.23]
[63,15.74,0.91,2.23]
[64,16.03,0.93,2.2200000000000002]
[65,16.329999999999998,0.95,2.21]
[66,16.649999999999999,0.97,2.19]
[67,16.98,0.99,2.17]
[68,16.829999999999998,1,2.16]
[69,16.190000000000001,1,2.15]
[70,15.54,1,2.15]
[71,14.9,1,2.14]
[72,14.27,1,2.13]
[73,13.63,1,2.12]
[74,13.01,1,2.1]

{"sheet":"x-201","index":12,"n_rows":74,"n_cols":7,"rows_kept":74,"cut":false,"hidden":false,"merged":[]}
["Government Actuary's Department"]
[{"$f":"IF(TITLE=\"> Enter workbook title here\",\"Enter workbook title in Cover sheet\",TITLE)","v":"Local Government Pension Scheme (LGPS) - Consolidated Factor Spreadsheet"}]
[{"$f":"TABLE_FACTOR_TYPE&\" - x-\"&TABLE_SERIES_NUMBER","v":"CETV - x-201"}]
[]
[]
["Data Item","Factor Table Information"]
["Scheme","LGPS_EW"]
["Section","All"]
["Factor Type","CETV"]
["Description","Non club transfers based on NPA 65"]
["Gender","Male"]
["Factor Age/Period Definition","Age last birthday at relevant date"]
["Section Number",0]
["Series Number",201]
["Table Reference","0-201"]
["Table Reference in Guidance","Table 9"]
["Related Factor Guidance Note","LGPS EW Individual Transfers 8 April 2020"]
["Date Factors Issued to Client","2023-05-25"]
["Date Factors Implemented (if known)","2023-06-01"]
["Factor Status","Issued"]
[]
[null,{"$f":"HYPERLINK(\"#'Factor List'!A1\",\"Back to Factor List\")","v":"Back to Factor List"}]
[]
[]
["Age","Gross pension of £1 pa","Lump sum of £1 pa","Surviving partner's pension of £1 pa","Adjustment for Pre 88 GMP of £1 pa","Adjustment for Post 88 GMP of £1 pa","Deduction for NI modification of £1 pa"]
[16,9.2100000000000009,0.44,1.34,0,0,0]
[17,9.35,0.45,1.41,0,0,0]
[18,9.48,0.46,1.48,0,0,0]
[19,9.6199999999999992,0.46,1.53,0,0,0]
[20,9.76,0.47,1.56,0,0,0]
[21,9.9,0.48,1.58,0,0,0]
[22,10.050000000000001,0.49,1.61,0,0,0]
[23,10.19,0.5,1.63,0,0,0]
[24,10.34,0.51,1.66,0,0,0]
[25,10.49,0.51,1.68,0,0,0]
[26,10.64,0.52,1.71,0,0,0]
[27,10.8,0.53,1.74,0,0,0]
[28,10.95,0.54,1.76,0,0,0]
[29,11.11,0.55000000000000004,1.79,0,0,0]
[30,11.27,0.56000000000000005,1.81,0,0,0]
[31,11.44,0.56999999999999995,1.84,0,0,0]
[32,11.61,0.57999999999999996,1.87,0,0,0]
[33,11.78,0.59,1.89,0,0,0]
[34,11.95,0.6,1.92,0,0,0]
[35,12.12,0.61,1.94,0,0,0]
[36,12.3,0.62,1.97,0,0,0]
[37,12.48,0.63,1.99,0,0,0]
[38,12.66,0.64,2.0099999999999998,0,0,0]
[39,12.85,0.65,2.04,0,0,0]
[40,13.04,0.66,2.06,0,0,0]
[41,13.23,0.67,2.09,0,0,0]
[42,13.43,0.68,2.11,0,0,0]
[43,13.63,0.7,2.13,0,0,0]
[44,13.83,0.71,2.15,0,0,0]
[45,14.04,0.72,2.17,0,0,0]
[46,14.25,0.73,2.19,0,0,0]
[47,14.47,0.74,2.21,0,0,0]
[48,14.69,0.76,2.23,0,0,0]
[49,14.91,0.77,2.25,0,0,0]
[50,15.14,0.78,2.2599999999999998,0,0,0]
[51,15.38,0.8,2.2799999999999998,0,0,0]
[52,15.62,0.81,2.29,0,0,0]
[53,15.86,0.82,2.2999999999999998,0,0,0]
[54,16.12,0.84,2.31,0,0,0]
[55,16.37,0.85,2.3199999999999998,0,0,0]
[56,16.64,0.87,2.33,0,0,0]
[57,16.91,0.88,2.34,0,0,0]
[58,17.190000000000001,0.9,2.34,0,0,0]
[59,17.489999999999998,0.91,2.34,0,0,0]
[60,17.79,0.93,2.34,0,0,0]
[61,18.100000000000001,0.94,2.33,0,0,0]
[62,18.43,0.96,2.3199999999999998,0,0,0]
[63,18.77,0.98,2.31,0,0,0]
[64,19.14,0.99,2.29,0,0,0]

{"sheet":"x-202","index":13,"n_rows":74,"n_cols":7,"rows_kept":74,"cut":false,"hidden":false,"merged":[]}
["Government Actuary's Department"]
[{"$f":"IF(TITLE=\"> Enter workbook title here\",\"Enter workbook title in Cover sheet\",TITLE)","v":"Local Government Pension Scheme (LGPS) - Consolidated Factor Spreadsheet"}]
[{"$f":"TABLE_FACTOR_TYPE&\" - x-\"&TABLE_SERIES_NUMBER","v":"CETV - x-202"}]
[]
[]
["Data Item","Factor Table Information"]
["Scheme","LGPS_EW"]
["Section","All"]
["Factor Type","CETV"]
["Description","Non club transfers based on NPA 65"]
["Gender","Female"]
["Factor Age/Period Definition","Age last birthday at relevant date"]
["Section Number",0]
["Series Number",202]
["Table Reference","0-202"]
["Table Reference in Guidance","Table 10"]
["Related Factor Guidance Note","LGPS EW Individual Transfers 8 April 2020"]
["Date Factors Issued to Client","2023-05-25"]
["Date Factors Implemented (if known)","2023-06-01"]
["Factor Status","Issued"]
[]
[null,{"$f":"HYPERLINK(\"#'Factor List'!A1\",\"Back to Factor List\")","v":"Back to Factor List"}]
[]
[]
["Age","Gross pension of £1 pa","Lump sum of £1 pa","Surviving partner's pension of £1 pa","Adjustment for Pre 88 GMP of £1 pa","Adjustment for Post 88 GMP of £1 pa","Deduction for NI modification of £1 pa"]
[16,9.2100000000000009,0.44,1.34,-4.6399999999999997,-4.6399999999999997,0]
[17,9.35,0.45,1.41,-4.6399999999999997,-4.6399999999999997,0]
[18,9.48,0.46,1.48,-4.6399999999999997,-4.6399999999999997,0]
[19,9.6199999999999992,0.46,1.53,-4.63,-4.63,0]
[20,9.76,0.47,1.56,-4.63,-4.63,0]
[21,9.9,0.48,1.58,-4.63,-4.63,0]
[22,10.050000000000001,0.49,1.61,-4.62,-4.62,0]
[23,10.19,0.5,1.63,-4.62,-4.62,0]
[24,10.34,0.51,1.66,-4.62,-4.62,0]
[25,10.49,0.51,1.68,-4.6100000000000003,-4.6100000000000003,0]
[26,10.64,0.52,1.71,-4.6100000000000003,-4.6100000000000003,0]
[27,10.8,0.53,1.74,-4.6100000000000003,-4.6100000000000003,0]
[28,10.95,0.54,1.76,-4.5999999999999996,-4.5999999999999996,0]
[29,11.11,0.55000000000000004,1.79,-4.5999999999999996,-4.5999999999999996,0]
[30,11.27,0.56000000000000005,1.81,-4.5999999999999996,-4.5999999999999996,0]
[31,11.44,0.56999999999999995,1.84,-4.59,-4.59,0]
[32,11.61,0.57999999999999996,1.87,-4.59,-4.59,0]
[33,11.78,0.59,1.89,-4.59,-4.59,0]
[34,11.95,0.6,1.92,-4.58,-4.58,0]
[35,12.12,0.61,1.94,-4.58,-4.58,0]
[36,12.3,0.62,1.97,-4.58,-4.58,0]
[37,12.48,0.63,1.99,-4.58,-4.58,0]
[38,12.66,0.64,2.0099999999999998,-4.57,-4.57,0]
[39,12.85,0.65,2.04,-4.57,-4.57,0]
[40,13.04,0.66,2.06,-4.57,-4.57,0]
[41,13.23,0.67,2.09,-4.57,-4.57,0]
[42,13.43,0.68,2.11,-4.57,-4.57,0]
[43,13.63,0.7,2.13,-4.5599999999999996,-4.5599999999999996,0]
[44,13.83,0.71,2.15,-4.5599999999999996,-4.5599999999999996,0]
[45,14.04,0.72,2.17,-4.5599999999999996,-4.5599999999999996,0]
[46,14.25,0.73,2.19,-4.5599999999999996,-4.5599999999999996,0]
[47,14.47,0.74,2.21,-4.5599999999999996,-4.5599999999999996,0]
[48,14.69,0.76,2.23,-4.5599999999999996,-4.5599999999999996,0]
[49,14.91,0.77,2.25,-4.5599999999999996,-4.5599999999999996,0]
[50,15.14,0.78,2.2599999999999998,-4.5599999999999996,-4.5599999999999996,0]
[51,15.38,0.8,2.2799999999999998,-4.5599999999999996,-4.5599999999999996,0]
[52,15.62,0.81,2.29,-4.5599999999999996,-4.5599999999999996,0]
[53,15.86,0.82,2.2999999999999998,-4.5599999999999996,-4.5599999999999996,0]
[54,16.12,0.84,2.31,-4.5599999999999996,-4.5599999999999996,0]
[55,16.37,0.85,2.3199999999999998,-4.5599999999999996,-4.5599999999999996,0]
[56,16.64,0.87,2.33,-4.57,-4.57,0]
[57,16.91,0.88,2.34,-4.57,-4.57,0]
[58,17.190000000000001,0.9,2.34,-4.57,-4.57,0]
[59,17.489999999999998,0.91,2.34,-4.58,-4.58,0]
[60,17.79,0.93,2.34,-4.76,-4.76,0]
[61,18.100000000000001,0.94,2.33,-3.84,-3.84,0]
[62,18.43,0.96,2.3199999999999998,-2.91,-2.91,0]
[63,18.77,0.98,2.31,-1.96,-1.96,0]
[64,19.14,0.99,2.29,-0.99,-0.99,0]

{"sheet":"x-203","index":14,"n_rows":75,"n_cols":7,"rows_kept":75,"cut":false,"hidden":false,"merged":[]}
["Government Actuary's Department"]
[{"$f":"IF(TITLE=\"> Enter workbook title here\",\"Enter workbook title in Cover sheet\",TITLE)","v":"Local Government Pension Scheme (LGPS) - Consolidated Factor Spreadsheet"}]
[{"$f":"TABLE_FACTOR_TYPE&\" - x-\"&TABLE_SERIES_NUMBER","v":"CETV - x-203"}]
[]
[]
["Data Item","Factor Table Information"]
["Scheme","LGPS_EW"]
["Section","All"]
["Factor Type","CETV"]
["Description","Non club transfers based on NPA 66"]
["Gender","Male"]
["Factor Age/Period Definition","Age last birthday at relevant date"]
["Section Number",0]
["Series Number",203]
["Table Reference","0-203"]
["Table Reference in Guidance","Table 11"]
["Related Factor Guidance Note","LGPS EW Individual Transfers 8 April 2020"]
["Date Factors Issued to Client","2023-05-25"]
["Date Factors Implemented (if known)","2023-06-01"]
["Factor Status","Issued"]
[]
[null,{"$f":"HYPERLINK(\"#'Factor List'!A1\",\"Back to Factor List\")","v":"Back to Factor List"}]
[]
[]
["Age","Gross pension of £1 pa","Lump sum of £1 pa","Surviving partner's pension of £1 pa","Adjustment for Pre 88 GMP of £1 pa","Adjustment for Post 88 GMP of £1 pa","Deduction for NI modification of £1 pa"]
[16,8.8000000000000007,0.43,1.34,-0.93,-0.93,0]
[17,8.93,0.44,1.41,-0.93,-0.93,0]
[18,9.0500000000000007,0.45,1.49,-0.93,-0.93,0]
[19,9.18,0.46,1.54,-0.92,-0.92,0]
[20,9.32,0.46,1.56,-0.92,-0.92,0]
[21,9.4499999999999993,0.47,1.59,-0.92,-0.92,0]
[22,9.59,0.48,1.62,-0.92,-0.92,0]
[23,9.73,0.49,1.64,-0.92,-0.92,0]
[24,9.8699999999999992,0.5,1.67,-0.92,-0.92,0]
[25,10.01,0.51,1.69,-0.92,-0.92,0]
[26,10.15,0.51,1.72,-0.92,-0.92,0]
[27,10.3,0.52,1.75,-0.92,-0.92,0]
[28,10.45,0.53,1.77,-0.92,-0.92,0]
[29,10.6,0.54,1.8,-0.92,-0.92,0]
[30,10.75,0.55000000000000004,1.82,-0.91,-0.91,0]
[31,10.91,0.56000000000000005,1.85,-0.91,-0.91,0]
[32,11.07,0.56999999999999995,1.88,-0.91,-0.91,0]
[33,11.23,0.57999999999999996,1.9,-0.91,-0.91,0]
[34,11.39,0.59,1.93,-0.91,-0.91,0]
[35,11.56,0.6,1.95,-0.91,-0.91,0]
[36,11.72,0.61,1.98,-0.91,-0.91,0]
[37,11.89,0.62,2,-0.91,-0.91,0]
[38,12.07,0.63,2.0299999999999998,-0.91,-0.91,0]
[39,12.24,0.64,2.0499999999999998,-0.91,-0.91,0]
[40,12.42,0.65,2.08,-0.91,-0.91,0]
[41,12.61,0.66,2.1,-0.91,-0.91,0]
[42,12.79,0.67,2.12,-0.91,-0.91,0]
[43,12.98,0.68,2.15,-0.91,-0.91,0]
[44,13.17,0.7,2.17,-0.91,-0.91,0]
[45,13.37,0.71,2.19,-0.91,-0.91,0]
[46,13.57,0.72,2.21,-0.91,-0.91,0]
[47,13.77,0.73,2.23,-0.91,-0.91,0]
[48,13.98,0.74,2.25,-0.91,-0.91,0]
[49,14.19,0.76,2.2599999999999998,-0.91,-0.91,0]
[50,14.41,0.77,2.2799999999999998,-0.91,-0.91,0]
[51,14.63,0.78,2.29,-0.91,-0.91,0]
[52,14.86,0.8,2.31,-0.91,-0.91,0]
[53,15.09,0.81,2.3199999999999998,-0.92,-0.92,0]
[54,15.33,0.82,2.33,-0.92,-0.92,0]
[55,15.57,0.84,2.34,-0.92,-0.92,0]
[56,15.82,0.85,2.35,-0.92,-0.92,0]
[57,16.079999999999998,0.87,2.36,-0.92,-0.92,0]
[58,16.350000000000001,0.88,2.36,-0.92,-0.92,0]
[59,16.62,0.9,2.36,-0.93,-0.93,0]
[60,16.91,0.91,2.36,-0.93,-0.93,0]
[61,17.2,0.93,2.35,-0.93,-0.93,0]
[62,17.510000000000002,0.94,2.34,-0.94,-0.94,0]
[63,17.84,0.96,2.33,-0.94,-0.94,0]
[64,18.18,0.98,2.31,-0.95,-0.95,0]
[65,18.54,0.99,2.2799999999999998,-0.99,-0.99,0]

{"sheet":"x-204","index":15,"n_rows":75,"n_cols":7,"rows_kept":75,"cut":false,"hidden":false,"merged":[]}
["Government Actuary's Department"]
[{"$f":"IF(TITLE=\"> Enter workbook title here\",\"Enter workbook title in Cover sheet\",TITLE)","v":"Local Government Pension Scheme (LGPS) - Consolidated Factor Spreadsheet"}]
[{"$f":"TABLE_FACTOR_TYPE&\" - x-\"&TABLE_SERIES_NUMBER","v":"CETV - x-204"}]
[]
[]
["Data Item","Factor Table Information"]
["Scheme","LGPS_EW"]
["Section","All"]
["Factor Type","CETV"]
["Description","Non club transfers based on NPA 66"]
["Gender","Female"]
["Factor Age/Period Definition","Age last birthday at relevant date"]
["Section Number",0]
["Series Number",204]
["Table Reference","0-204"]
["Table Reference in Guidance","Table 12"]
["Related Factor Guidance Note","LGPS EW Individual Transfers 8 April 2020"]
["Date Factors Issued to Client","2023-05-25"]
["Date Factors Implemented (if known)","2023-06-01"]
["Factor Status","Issued"]
[]
[null,{"$f":"HYPERLINK(\"#'Factor List'!A1\",\"Back to Factor List\")","v":"Back to Factor List"}]
[]
[]
["Age","Gross pension of £1 pa","Lump sum of £1 pa","Surviving partner's pension of £1 pa","Adjustment for Pre 88 GMP of £1 pa","Adjustment for Post 88 GMP of £1 pa","Deduction for NI modification of £1 pa"]
[16,8.8000000000000007,0.43,1.34,-5.52,-5.52,0]
[17,8.93,0.44,1.41,-5.52,-5.52,0]
[18,9.0500000000000007,0.45,1.49,-5.51,-5.51,0]
[19,9.18,0.46,1.54,-5.51,-5.51,0]
[20,9.32,0.46,1.56,-5.5,-5.5,0]
[21,9.4499999999999993,0.47,1.59,-5.5,-5.5,0]
[22,9.59,0.48,1.62,-5.49,-5.49,0]
[23,9.73,0.49,1.64,-5.49,-5.49,0]
[24,9.8699999999999992,0.5,1.67,-5.49,-5.49,0]
[25,10.01,0.51,1.69,-5.48,-5.48,0]
[26,10.15,0.51,1.72,-5.48,-5.48,0]
[27,10.3,0.52,1.75,-5.47,-5.47,0]
[28,10.45,0.53,1.77,-5.47,-5.47,0]
[29,10.6,0.54,1.8,-5.47,-5.47,0]
[30,10.75,0.55000000000000004,1.82,-5.46,-5.46,0]
[31,10.91,0.56000000000000005,1.85,-5.46,-5.46,0]
[32,11.07,0.56999999999999995,1.88,-5.46,-5.46,0]
[33,11.23,0.57999999999999996,1.9,-5.45,-5.45,0]
[34,11.39,0.59,1.93,-5.45,-5.45,0]
[35,11.56,0.6,1.95,-5.44,-5.44,0]
[36,11.72,0.61,1.98,-5.44,-5.44,0]
[37,11.89,0.62,2,-5.44,-5.44,0]
[38,12.07,0.63,2.0299999999999998,-5.44,-5.44,0]
[39,12.24,0.64,2.0499999999999998,-5.43,-5.43,0]
[40,12.42,0.65,2.08,-5.43,-5.43,0]
[41,12.61,0.66,2.1,-5.43,-5.43,0]
[42,12.79,0.67,2.12,-5.42,-5.42,0]
[43,12.98,0.68,2.15,-5.42,-5.42,0]
[44,13.17,0.7,2.17,-5.42,-5.42,0]
[45,13.37,0.71,2.19,-5.42,-5.42,0]
[46,13.57,0.72,2.21,-5.42,-5.42,0]
[47,13.77,0.73,2.23,-5.42,-5.42,0]
[48,13.98,0.74,2.25,-5.41,-5.41,0]
[49,14.19,0.76,2.2599999999999998,-5.41,-5.41,0]
[50,14.41,0.77,2.2799999999999998,-5.41,-5.41,0]
[51,14.63,0.78,2.29,-5.41,-5.41,0]
[52,14.86,0.8,2.31,-5.41,-5.41,0]
[53,15.09,0.81,2.3199999999999998,-5.42,-5.42,0]
[54,15.33,0.82,2.33,-5.42,-5.42,0]
[55,15.57,0.84,2.34,-5.42,-5.42,0]
[56,15.82,0.85,2.35,-5.42,-5.42,0]
[57,16.079999999999998,0.87,2.36,-5.43,-5.43,0]
[58,16.350000000000001,0.88,2.36,-5.43,-5.43,0]
[59,16.62,0.9,2.36,-5.44,-5.44,0]
[60,16.91,0.91,2.36,-5.65,-5.65,0]
[61,17.2,0.93,2.35,-4.76,-4.76,0]
[62,17.510000000000002,0.94,2.34,-3.84,-3.84,0]
[63,17.84,0.96,2.33,-2.91,-2.91,0]
[64,18.18,0.98,2.31,-1.96,-1.96,0]
[65,18.54,0.99,2.2799999999999998,-0.99,-0.99,0]

{"sheet":"x-205","index":16,"n_rows":76,"n_cols":7,"rows_kept":76,"cut":false,"hidden":false,"merged":[]}
["Government Actuary's Department"]
[{"$f":"IF(TITLE=\"> Enter workbook title here\",\"Enter workbook title in Cover sheet\",TITLE)","v":"Local Government Pension Scheme (LGPS) - Consolidated Factor Spreadsheet"}]
[{"$f":"TABLE_FACTOR_TYPE&\" - x-\"&TABLE_SERIES_NUMBER","v":"CETV - x-205"}]
[]
[]
["Data Item","Factor Table Information"]
["Scheme","LGPS_EW"]
["Section","All"]
["Factor Type","CETV"]
["Description","Non club transfers based on NPA 67"]
["Gender","Male"]
["Factor Age/Period Definition","Age last birthday at relevant date"]
["Section Number",0]
["Series Number",205]
["Table Reference","0-205"]
["Table Reference in Guidance","Table 13"]
["Related Factor Guidance Note","LGPS EW Individual Transfers 8 April 2020"]
["Date Factors Issued to Client","2023-05-25"]
["Date Factors Implemented (if known)","2023-06-01"]
["Factor Status","Issued"]
[]
[null,{"$f":"HYPERLINK(\"#'Factor List'!A1\",\"Back to Factor List\")","v":"Back to Factor List"}]
[]
[]
["Age","Gross pension of £1 pa","Lump sum of £1 pa","Surviving partner's pension of £1 pa","Adjustment for Pre 88 GMP of £1 pa","Adjustment for Post 88 GMP of £1 pa","Deduction for NI modification of £1 pa"]
[16,8.39,0.43,1.35,-1.84,-1.84,0]
[17,8.51,0.43,1.42,-1.83,-1.83,0]
[18,8.6300000000000008,0.44,1.5,-1.83,-1.83,0]
[19,8.76,0.45,1.55,-1.83,-1.83,0]
[20,8.8800000000000008,0.46,1.57,-1.83,-1.83,0]
[21,9.01,0.46,1.6,-1.82,-1.82,0]
[22,9.14,0.47,1.62,-1.82,-1.82,0]
[23,9.27,0.48,1.65,-1.82,-1.82,0]
[24,9.4,0.49,1.68,-1.82,-1.82,0]
[25,9.5399999999999991,0.5,1.7,-1.82,-1.82,0]
[26,9.68,0.51,1.73,-1.82,-1.82,0]
[27,9.81,0.51,1.76,-1.81,-1.81,0]
[28,9.9600000000000009,0.52,1.78,-1.81,-1.81,0]
[29,10.1,0.53,1.81,-1.81,-1.81,0]
[30,10.24,0.54,1.84,-1.81,-1.81,0]
[31,10.39,0.55000000000000004,1.86,-1.81,-1.81,0]
[32,10.54,0.56000000000000005,1.89,-1.81,-1.81,0]
[33,10.69,0.56999999999999995,1.91,-1.8,-1.8,0]
[34,10.84,0.57999999999999996,1.94,-1.8,-1.8,0]
[35,11,0.59,1.97,-1.8,-1.8,0]
[36,11.16,0.6,1.99,-1.8,-1.8,0]
[37,11.32,0.61,2.02,-1.8,-1.8,0]
[38,11.49,0.62,2.04,-1.8,-1.8,0]
[39,11.65,0.63,2.0699999999999998,-1.8,-1.8,0]
[40,11.82,0.64,2.09,-1.8,-1.8,0]
[41,11.99,0.65,2.12,-1.8,-1.8,0]
[42,12.17,0.66,2.14,-1.8,-1.8,0]
[43,12.35,0.67,2.16,-1.8,-1.8,0]
[44,12.53,0.68,2.1800000000000002,-1.8,-1.8,0]
[45,12.71,0.7,2.21,-1.8,-1.8,0]
[46,12.9,0.71,2.23,-1.8,-1.8,0]
[47,13.1,0.72,2.25,-1.8,-1.8,0]
[48,13.29,0.73,2.2599999999999998,-1.8,-1.8,0]
[49,13.49,0.74,2.2799999999999998,-1.8,-1.8,0]
[50,13.7,0.76,2.2999999999999998,-1.8,-1.8,0]
[51,13.91,0.77,2.31,-1.81,-1.81,0]
[52,14.12,0.78,2.33,-1.81,-1.81,0]
[53,14.34,0.8,2.34,-1.81,-1.81,0]
[54,14.56,0.81,2.35,-1.81,-1.81,0]
[55,14.79,0.82,2.36,-1.82,-1.82,0]
[56,15.03,0.84,2.37,-1.82,-1.82,0]
[57,15.27,0.85,2.38,-1.82,-1.82,0]
[58,15.52,0.87,2.38,-1.83,-1.83,0]
[59,15.78,0.88,2.38,-1.83,-1.83,0]
[60,16.05,0.9,2.38,-1.84,-1.84,0]
[61,16.329999999999998,0.91,2.37,-1.84,-1.84,0]
[62,16.62,0.93,2.36,-1.85,-1.85,0]
[63,16.93,0.94,2.35,-1.86,-1.86,0]
[64,17.25,0.96,2.33,-1.87,-1.87,0]
[65,17.59,0.98,2.31,-1.95,-1.95,0]
[66,17.95,0.99,2.2799999999999998,-0.99,-0.99,0]

{"sheet":"x-206","index":17,"n_rows":76,"n_cols":7,"rows_kept":76,"cut":false,"hidden":false,"merged":[]}
["Government Actuary's Department"]
[{"$f":"IF(TITLE=\"> Enter workbook title here\",\"Enter workbook title in Cover sheet\",TITLE)","v":"Local Government Pension Scheme (LGPS) - Consolidated Factor Spreadsheet"}]
[{"$f":"TABLE_FACTOR_TYPE&\" - x-\"&TABLE_SERIES_NUMBER","v":"CETV - x-206"}]
[]
[]
["Data Item","Factor Table Information"]
["Scheme","LGPS_EW"]
["Section","All"]
["Factor Type","CETV"]
["Description","Non club transfers based on NPA 67"]
["Gender","Female"]
["Factor Age/Period Definition","Age last birthday at relevant date"]
["Section Number",0]
["Series Number",206]
["Table Reference","0-206"]
["Table Reference in Guidance","Table 14"]
["Related Factor Guidance Note","LGPS EW Individual Transfers 8 April 2020"]
["Date Factors Issued to Client","2023-05-25"]
["Date Factors Implemented (if known)","2023-06-01"]
["Factor Status","Issued"]
[]
[null,{"$f":"HYPERLINK(\"#'Factor List'!A1\",\"Back to Factor List\")","v":"Back to Factor List"}]
[]
[]
["Age","Gross pension of £1 pa","Lump sum of £1 pa","Surviving partner's pension of £1 pa","Adjustment for Pre 88 GMP of £1 pa","Adjustment for Post 88 GMP of £1 pa","Deduction for NI modification of £1 pa"]
[16,8.39,0.43,1.35,-6.38,-6.38,0]
[17,8.51,0.43,1.42,-6.37,-6.37,0]
[18,8.6300000000000008,0.44,1.5,-6.37,-6.37,0]
[19,8.76,0.45,1.55,-6.36,-6.36,0]
[20,8.8800000000000008,0.46,1.57,-6.36,-6.36,0]
[21,9.01,0.46,1.6,-6.35,-6.35,0]
[22,9.14,0.47,1.62,-6.35,-6.35,0]
[23,9.27,0.48,1.65,-6.34,-6.34,0]
[24,9.4,0.49,1.68,-6.34,-6.34,0]
[25,9.5399999999999991,0.5,1.7,-6.33,-6.33,0]
[26,9.68,0.51,1.73,-6.33,-6.33,0]
[27,9.81,0.51,1.76,-6.33,-6.33,0]
[28,9.9600000000000009,0.52,1.78,-6.32,-6.32,0]
[29,10.1,0.53,1.81,-6.32,-6.32,0]
[30,10.24,0.54,1.84,-6.31,-6.31,0]
[31,10.39,0.55000000000000004,1.86,-6.31,-6.31,0]
[32,10.54,0.56000000000000005,1.89,-6.3,-6.3,0]
[33,10.69,0.56999999999999995,1.91,-6.3,-6.3,0]
[34,10.84,0.57999999999999996,1.94,-6.29,-6.29,0]
[35,11,0.59,1.97,-6.29,-6.29,0]
[36,11.16,0.6,1.99,-6.29,-6.29,0]
[37,11.32,0.61,2.02,-6.28,-6.28,0]
[38,11.49,0.62,2.04,-6.28,-6.28,0]
[39,11.65,0.63,2.0699999999999998,-6.28,-6.28,0]
[40,11.82,0.64,2.09,-6.27,-6.27,0]
[41,11.99,0.65,2.12,-6.27,-6.27,0]
[42,12.17,0.66,2.14,-6.27,-6.27,0]
[43,12.35,0.67,2.16,-6.26,-6.26,0]
[44,12.53,0.68,2.1800000000000002,-6.26,-6.26,0]
[45,12.71,0.7,2.21,-6.26,-6.26,0]
[46,12.9,0.71,2.23,-6.26,-6.26,0]
[47,13.1,0.72,2.25,-6.26,-6.26,0]
[48,13.29,0.73,2.2599999999999998,-6.25,-6.25,0]
[49,13.49,0.74,2.2799999999999998,-6.25,-6.25,0]
[50,13.7,0.76,2.2999999999999998,-6.25,-6.25,0]
[51,13.91,0.77,2.31,-6.25,-6.25,0]
[52,14.12,0.78,2.33,-6.25,-6.25,0]
[53,14.34,0.8,2.34,-6.26,-6.26,0]
[54,14.56,0.81,2.35,-6.26,-6.26,0]
[55,14.79,0.82,2.36,-6.26,-6.26,0]
[56,15.03,0.84,2.37,-6.26,-6.26,0]
[57,15.27,0.85,2.38,-6.27,-6.27,0]
[58,15.52,0.87,2.38,-6.27,-6.27,0]
[59,15.78,0.88,2.38,-6.28,-6.28,0]
[60,16.05,0.9,2.38,-6.53,-6.53,0]
[61,16.329999999999998,0.91,2.37,-5.65,-5.65,0]
[62,16.62,0.93,2.36,-4.75,-4.75,0]
[63,16.93,0.94,2.35,-3.84,-3.84,0]
[64,17.25,0.96,2.33,-2.91,-2.91,0]
[65,17.59,0.98,2.31,-1.96,-1.96,0]
[66,17.95,0.99,2.2799999999999998,-0.99,-0.99,0]

{"sheet":"x-207","index":18,"n_rows":77,"n_cols":7,"rows_kept":77,"cut":false,"hidden":false,"merged":[]}
["Government Actuary's Department"]
[{"$f":"IF(TITLE=\"> Enter workbook title here\",\"Enter workbook title in Cover sheet\",TITLE)","v":"Local Government Pension Scheme (LGPS) - Consolidated Factor Spreadsheet"}]
[{"$f":"TABLE_FACTOR_TYPE&\" - x-\"&TABLE_SERIES_NUMBER","v":"CETV - x-207"}]
[]
[]
["Data Item","Factor Table Information"]
["Scheme","LGPS_EW"]
["Section","All"]
["Factor Type","CETV"]
["Description","Non club transfers based on NPA 68"]
["Gender","Male"]
["Factor Age/Period Definition","Age last birthday at relevant date"]
["Section Number",0]
["Series Number",207]
["Table Reference","0-207"]
["Table Reference in Guidance","Table 15"]
["Related Factor Guidance Note","LGPS EW Individual Transfers 8 April 2020"]
["Date Factors Issued to Client","2023-05-25"]
["Date Factors Implemented (if known)","2023-06-01"]
["Factor Status","Issued"]
[]
[null,{"$f":"HYPERLINK(\"#'Factor List'!A1\",\"Back to Factor List\")","v":"Back to Factor List"}]
[]
[]
["Age","Gross pension of £1 pa","Lump sum of £1 pa","Surviving partner's pension of £1 pa","Adjustment for Pre 88 GMP of £1 pa","Adjustment for Post 88 GMP of £1 pa","Deduction for NI modification of £1 pa"]
[16,8,0.42,1.36,-2.72,-2.72,0]
[17,8.11,0.43,1.43,-2.72,-2.72,0]
[18,8.23,0.43,1.51,-2.72,-2.72,0]
[19,8.34,0.44,1.56,-2.71,-2.71,0]
[20,8.4600000000000009,0.45,1.58,-2.71,-2.71,0]
[21,8.58,0.46,1.61,-2.71,-2.71,0]
[22,8.6999999999999993,0.46,1.63,-2.71,-2.71,0]
[23,8.83,0.47,1.66,-2.7,-2.7,0]
[24,8.9499999999999993,0.48,1.69,-2.7,-2.7,0]
[25,9.08,0.49,1.71,-2.7,-2.7,0]
[26,9.2100000000000009,0.5,1.74,-2.69,-2.69,0]
[27,9.34,0.51,1.77,-2.69,-2.69,0]
[28,9.4700000000000006,0.51,1.8,-2.69,-2.69,0]
[29,9.61,0.52,1.82,-2.69,-2.69,0]
[30,9.74,0.53,1.85,-2.68,-2.68,0]
[31,9.8800000000000008,0.54,1.88,-2.68,-2.68,0]
[32,10.02,0.55000000000000004,1.9,-2.68,-2.68,0]
[33,10.17,0.56000000000000005,1.93,-2.68,-2.68,0]
[34,10.31,0.56999999999999995,1.95,-2.68,-2.68,0]
[35,10.46,0.57999999999999996,1.98,-2.67,-2.67,0]
[36,10.61,0.59,2.0099999999999998,-2.67,-2.67,0]
[37,10.76,0.6,2.0299999999999998,-2.67,-2.67,0]
[38,10.92,0.61,2.06,-2.67,-2.67,0]
[39,11.07,0.62,2.08,-2.67,-2.67,0]
[40,11.23,0.63,2.11,-2.67,-2.67,0]
[41,11.4,0.64,2.13,-2.67,-2.67,0]
[42,11.56,0.65,2.16,-2.67,-2.67,0]
[43,11.73,0.66,2.1800000000000002,-2.67,-2.67,0]
[44,11.9,0.67,2.2000000000000002,-2.67,-2.67,0]
[45,12.07,0.68,2.2200000000000002,-2.67,-2.67,0]
[46,12.25,0.7,2.2400000000000002,-2.67,-2.67,0]
[47,12.43,0.71,2.2599999999999998,-2.67,-2.67,0]
[48,12.62,0.72,2.2799999999999998,-2.67,-2.67,0]
[49,12.81,0.73,2.2999999999999998,-2.67,-2.67,0]
[50,13,0.74,2.3199999999999998,-2.67,-2.67,0]
[51,13.2,0.76,2.33,-2.68,-2.68,0]
[52,13.4,0.77,2.35,-2.68,-2.68,0]
[53,13.6,0.78,2.36,-2.68,-2.68,0]
[54,13.81,0.8,2.37,-2.69,-2.69,0]
[55,14.03,0.81,2.38,-2.69,-2.69,0]
[56,14.25,0.82,2.39,-2.7,-2.7,0]
[57,14.48,0.84,2.4,-2.7,-2.7,0]
[58,14.72,0.85,2.4,-2.71,-2.71,0]
[59,14.96,0.87,2.4,-2.72,-2.72,0]
[60,15.21,0.88,2.4,-2.72,-2.72,0]
[61,15.48,0.9,2.39,-2.73,-2.73,0]
[62,15.75,0.91,2.39,-2.74,-2.74,0]
[63,16.04,0.93,2.37,-2.76,-2.76,0]
[64,16.34,0.94,2.35,-2.77,-2.77,0]
[65,16.66,0.96,2.33,-2.89,-2.89,0]
[66,17,0.98,2.2999999999999998,-1.95,-1.95,0]
[67,17.350000000000001,0.99,2.27,-0.99,-0.99,0]

{"sheet":"x-208","index":19,"n_rows":77,"n_cols":7,"rows_kept":77,"cut":false,"hidden":false,"merged":[]}
["Government Actuary's Department"]
[{"$f":"IF(TITLE=\"> Enter workbook title here\",\"Enter workbook title in Cover sheet\",TITLE)","v":"Local Government Pension Scheme (LGPS) - Consolidated Factor Spreadsheet"}]
[{"$f":"TABLE_FACTOR_TYPE&\" - x-\"&TABLE_SERIES_NUMBER","v":"CETV - x-208"}]
[]
[]
["Data Item","Factor Table Information"]
["Scheme","LGPS_EW"]
["Section","All"]
["Factor Type","CETV"]
["Description","Non club transfers based on NPA 68"]
["Gender","Female"]
["Factor Age/Period Definition","Age last birthday at relevant date"]
["Section Number",0]
["Series Number",208]
["Table Reference","0-208"]
["Table Reference in Guidance","Table 16"]
["Related Factor Guidance Note","LGPS EW Individual Transfers 8 April 2020"]
["Date Factors Issued to Client","2023-05-25"]
["Date Factors Implemented (if known)","2023-06-01"]
["Factor Status","Issued"]
[]
[null,{"$f":"HYPERLINK(\"#'Factor List'!A1\",\"Back to Factor List\")","v":"Back to Factor List"}]
[]
[]
["Age","Gross pension of £1 pa","Lump sum of £1 pa","Surviving partner's pension of £1 pa","Adjustment for Pre 88 GMP of £1 pa","Adjustment for Post 88 GMP of £1 pa","Deduction for NI modification of £1 pa"]
[16,8,0.42,1.36,-7.22,-7.22,0]
[17,8.11,0.43,1.43,-7.22,-7.22,0]
[18,8.23,0.43,1.51,-7.21,-7.21,0]
[19,8.34,0.44,1.56,-7.2,-7.2,0]
[20,8.4600000000000009,0.45,1.58,-7.2,-7.2,0]
[21,8.58,0.46,1.61,-7.19,-7.19,0]
[22,8.6999999999999993,0.46,1.63,-7.19,-7.19,0]
[23,8.83,0.47,1.66,-7.18,-7.18,0]
[24,8.9499999999999993,0.48,1.69,-7.18,-7.18,0]
[25,9.08,0.49,1.71,-7.17,-7.17,0]
[26,9.2100000000000009,0.5,1.74,-7.16,-7.16,0]
[27,9.34,0.51,1.77,-7.16,-7.16,0]
[28,9.4700000000000006,0.51,1.8,-7.15,-7.15,0]
[29,9.61,0.52,1.82,-7.15,-7.15,0]
[30,9.74,0.53,1.85,-7.14,-7.14,0]
[31,9.8800000000000008,0.54,1.88,-7.14,-7.14,0]
[32,10.02,0.55000000000000004,1.9,-7.13,-7.13,0]
[33,10.17,0.56000000000000005,1.93,-7.13,-7.13,0]
[34,10.31,0.56999999999999995,1.95,-7.12,-7.12,0]
[35,10.46,0.57999999999999996,1.98,-7.12,-7.12,0]
[36,10.61,0.59,2.0099999999999998,-7.11,-7.11,0]
[37,10.76,0.6,2.0299999999999998,-7.11,-7.11,0]
[38,10.92,0.61,2.06,-7.11,-7.11,0]
[39,11.07,0.62,2.08,-7.1,-7.1,0]
[40,11.23,0.63,2.11,-7.1,-7.1,0]
[41,11.4,0.64,2.13,-7.09,-7.09,0]
[42,11.56,0.65,2.16,-7.09,-7.09,0]
[43,11.73,0.66,2.1800000000000002,-7.09,-7.09,0]
[44,11.9,0.67,2.2000000000000002,-7.08,-7.08,0]
[45,12.07,0.68,2.2200000000000002,-7.08,-7.08,0]
[46,12.25,0.7,2.2400000000000002,-7.08,-7.08,0]
[47,12.43,0.71,2.2599999999999998,-7.08,-7.08,0]
[48,12.62,0.72,2.2799999999999998,-7.08,-7.08,0]
[49,12.81,0.73,2.2999999999999998,-7.08,-7.08,0]
[50,13,0.74,2.3199999999999998,-7.07,-7.07,0]
[51,13.2,0.76,2.33,-7.07,-7.07,0]
[52,13.4,0.77,2.35,-7.07,-7.07,0]
[53,13.6,0.78,2.36,-7.08,-7.08,0]
[54,13.81,0.8,2.37,-7.08,-7.08,0]
[55,14.03,0.81,2.38,-7.08,-7.08,0]
[56,14.25,0.82,2.39,-7.09,-7.09,0]
[57,14.48,0.84,2.4,-7.09,-7.09,0]
[58,14.72,0.85,2.4,-7.1,-7.1,0]
[59,14.96,0.87,2.4,-7.11,-7.11,0]
[60,15.21,0.88,2.4,-7.39,-7.39,0]
[61,15.48,0.9,2.39,-6.52,-6.52,0]
[62,15.75,0.91,2.39,-5.64,-5.64,0]
[63,16.04,0.93,2.37,-4.74,-4.74,0]
[64,16.34,0.94,2.35,-3.83,-3.83,0]
[65,16.66,0.96,2.33,-2.9,-2.9,0]
[66,17,0.98,2.2999999999999998,-1.96,-1.96,0]
[67,17.350000000000001,0.99,2.27,-0.99,-0.99,0]

{"sheet":"x-209","index":20,"n_rows":84,"n_cols":5,"rows_kept":84,"cut":false,"hidden":false,"merged":[]}
["Government Actuary's Department"]
["LGPS_EW - Consolidated Factor Spreadsheet"]
["TV In (non-club) - x-209"]
[]
[]
["Data Item","Factor Table Information"]
["Scheme","LGPS_EW"]
["Section","All"]
["Factor Type","TV In (non-club)"]
["Description","Factors for non-club transfers-in based on NPA 65 - Males (NPA65)"]
["Gender","Male"]
["Factor Age/Period Definition","Age last birthday at relevant date"]
["Section Number",0]
["Series Number",209]
["Table Reference","0-209"]
["Table Reference in Guidance","Table NM65"]
["Related Factor Guidance Note","LGPS EW Individual Transfers 8 April 2020"]
["Date Factors Issued to Client","2023-06-30"]
["Date Factors Implemented (if known)","2023-07-03"]
["Factor Status","Issued"]
[]
[null,{"$f":"HYPERLINK(\"#'Factor List'!A1\",\"Back to Factor List\")","v":"Back to Factor List"}]
[]
[]
["Age","Gross Pension of £1 pa","Surviving Partner's Pension of £1 pa","Adjustment for GMP of £1 pa - Pre-88","Adjustment for GMP of £1 pa - Post-88"]
[16,9.3699999999999992,1.34,0,0]
[17,9.51,1.37,0,0]
[18,9.65,1.47,0,0]
[19,9.7899999999999991,1.53,0,0]
[20,9.94,1.53,0,0]
[21,10.09,1.53,0,0]
[22,10.23,1.6,0,0]
[23,10.39,1.6,0,0]
[24,10.54,1.63,0,0]
[25,10.7,1.63,0,0]
[26,10.85,1.7,0,0]
[27,11.01,1.73,0,0]
[28,11.18,1.73,0,0]
[29,11.34,1.76,0,0]
[30,11.51,1.76,0,0]
[31,11.68,1.8,0,0]
[32,11.85,1.83,0,0]
[33,12.02,1.86,0,0]
[34,12.2,1.86,0,0]
[35,12.38,1.89,0,0]
[36,12.56,1.93,0,0]
[37,12.74,1.96,0,0]
[38,12.93,1.96,0,0]
[39,13.12,1.99,0,0]
[40,13.31,2.02,0,0]
[41,13.5,2.06,0,0]
[42,13.7,2.06,0,0]
[43,13.9,2.09,0,0]
[44,14.1,2.12,0,0]
[45,14.31,2.12,0,0]
[46,14.52,2.16,0,0]
[47,14.73,2.16,0,0]
[48,14.94,2.19,0,0]
[49,15.16,2.2200000000000002,0,0]
[50,15.38,2.2200000000000002,0,0]
[51,15.6,2.25,0,0]
[52,15.83,2.25,0,0]
[53,16.059999999999999,2.29,0,0]
[54,16.3,2.29,0,0]
[55,16.54,2.3199999999999998,0,0]
[56,16.79,2.3199999999999998,0,0]
[57,17.05,2.3199999999999998,0,0]
[58,17.309999999999999,2.3199999999999998,0,0]
[59,17.579999999999998,2.3199999999999998,0,0]
[60,17.86,2.3199999999999998,0,0]
[61,18.16,2.3199999999999998,0,0]
[62,18.47,2.29,0,0]
[63,18.79,2.3199999999999998,0,0]
[64,19.14,2.29,0,0]
[65,18.989999999999998,2.27,0,0]
[66,18.309999999999999,2.27,0,0]
[67,17.64,2.2599999999999998,0,0]
[68,16.96,2.2400000000000002,0,0]
[69,16.28,2.11,0,0]
[70,15.6,1.98,0,0]
[71,14.92,1.96,0,0]
[72,14.25,1.94,0,0]
[73,13.59,1.92,0,0]
[74,12.94,1.77,0,0]

{"sheet":"x-210","index":21,"n_rows":84,"n_cols":5,"rows_kept":84,"cut":false,"hidden":false,"merged":[]}
["Government Actuary's Department"]
["LGPS_EW - Consolidated Factor Spreadsheet"]
["TV In (non-club) - x-210"]
[]
[]
["Data Item","Factor Table Information"]
["Scheme","LGPS_EW"]
["Section","All"]
["Factor Type","TV In (non-club)"]
["Description","Factors for non-club transfers-in based on NPA 65 - Females (NPA65)"]
["Gender","Female"]
["Factor Age/Period Definition","Age last birthday at relevant date"]
["Section Number",0]
["Series Number",210]
["Table Reference","0-210"]
["Table Reference in Guidance","Table NF65"]
["Related Factor Guidance Note","LGPS EW Individual Transfers 8 April 2020"]
["Date Factors Issued to Client","2023-06-30"]
["Date Factors Implemented (if known)","2023-07-03"]
["Factor Status","Issued"]
[]
[null,{"$f":"HYPERLINK(\"#'Factor List'!A1\",\"Back to Factor List\")","v":"Back to Factor List"}]
[]
[]
["Age","Gross Pension of £1 pa","Surviving Partner's Pension of £1 pa","Adjustment for GMP of £1 pa - Pre-88","Adjustment for GMP of £1 pa - Post-88"]
[16,9.3699999999999992,1.34,0,0]
[17,9.51,1.37,0,0]
[18,9.65,1.47,0,0]
[19,9.7899999999999991,1.53,0,0]
[20,9.94,1.53,0,0]
[21,10.09,1.53,0,0]
[22,10.23,1.6,0,0]
[23,10.39,1.6,0,0]
[24,10.54,1.63,0,0]
[25,10.7,1.63,0,0]
[26,10.85,1.7,0,0]
[27,11.01,1.73,0,0]
[28,11.18,1.73,0,0]
[29,11.34,1.76,0,0]
[30,11.51,1.76,0,0]
[31,11.68,1.8,0,0]
[32,11.85,1.83,0,0]
[33,12.02,1.86,0,0]
[34,12.2,1.86,0,0]
[35,12.38,1.89,0,0]
[36,12.56,1.93,0,0]
[37,12.74,1.96,0,0]
[38,12.93,1.96,0,0]
[39,13.12,1.99,0,0]
[40,13.31,2.02,0,0]
[41,13.5,2.06,0,0]
[42,13.7,2.06,0,0]
[43,13.9,2.09,0,0]
[44,14.1,2.12,0,0]
[45,14.31,2.12,0,0]
[46,14.52,2.16,0,0]
[47,14.73,2.16,0,0]
[48,14.94,2.19,0,0]
[49,15.16,2.2200000000000002,0,0]
[50,15.38,2.2200000000000002,0,0]
[51,15.6,2.25,0,0]
[52,15.83,2.25,0,0]
[53,16.059999999999999,2.29,0,0]
[54,16.3,2.29,0,0]
[55,16.54,2.3199999999999998,0,0]
[56,16.79,2.3199999999999998,0,0]
[57,17.05,2.3199999999999998,0,0]
[58,17.309999999999999,2.3199999999999998,0,0]
[59,17.579999999999998,2.3199999999999998,0,0]
[60,17.86,2.3199999999999998,0,0]
[61,18.16,2.3199999999999998,0,0]
[62,18.47,2.29,0,0]
[63,18.79,2.3199999999999998,0,0]
[64,19.14,2.29,0,0]
[65,18.989999999999998,2.27,0,0]
[66,18.309999999999999,2.27,0,0]
[67,17.64,2.2599999999999998,0,0]
[68,16.96,2.2400000000000002,0,0]
[69,16.28,2.11,0,0]
[70,15.6,1.98,0,0]
[71,14.92,1.96,0,0]
[72,14.25,1.94,0,0]
[73,13.59,1.92,0,0]
[74,12.94,1.77,0,0]

{"sheet":"x-211","index":22,"n_rows":84,"n_cols":5,"rows_kept":84,"cut":false,"hidden":false,"merged":[]}
["Government Actuary's Department"]
[{"$f":"IF(TITLE=\"> Enter workbook title here\",\"Enter workbook title in Cover sheet\",TITLE)","v":"Local Government Pension Scheme (LGPS) - Consolidated Factor Spreadsheet"}]
["TV In (non-club) - x-211"]
[]
[]
["Data Item","Factor Table Information"]
["Scheme","LGPS_EW"]
["Section","All"]
["Factor Type","TV In (non-club)"]
["Description","Factors for non-club transfers-in based on NPA 66 - Males (NPA66)"]
["Gender","Male"]
["Factor Age/Period Definition","Age last birthday at relevant date"]
["Section Number",0]
["Series Number",211]
["Table Reference","0-211"]
["Table Reference in Guidance","Table NM66"]
["Related Factor Guidance Note","LGPS EW Individual Transfers 8 April 2020"]
["Date Factors Issued to Client","2023-06-30"]
["Date Factors Implemented (if known)","2023-07-03"]
["Factor Status","Issued"]
[]
[null,{"$f":"HYPERLINK(\"#'Factor List'!A1\",\"Back to Factor List\")","v":"Back to Factor List"}]
[]
[]
["Age","Gross Pension of £1 pa","Surviving Partner's Pension of £1 pa","Adjustment for GMP of £1 pa - Pre-88","Adjustment for GMP of £1 pa - Post-88"]
[16,8.98,1.34,0,0]
[17,9.11,1.4,0,0]
[18,9.24,1.5,0,0]
[19,9.3800000000000008,1.53,0,0]
[20,9.52,1.57,0,0]
[21,9.66,1.57,0,0]
[22,9.8000000000000007,1.6,0,0]
[23,9.9499999999999993,1.6,0,0]
[24,10.09,1.67,0,0]
[25,10.24,1.67,0,0]
[26,10.39,1.7,0,0]
[27,10.55,1.7,0,0]
[28,10.7,1.73,0,0]
[29,10.86,1.76,0,0]
[30,11.02,1.8,0,0]
[31,11.18,1.8,0,0]
[32,11.34,1.86,0,0]
[33,11.51,1.86,0,0]
[34,11.68,1.86,0,0]
[35,11.85,1.89,0,0]
[36,12.02,1.93,0,0]
[37,12.19,1.96,0,0]
[38,12.37,1.99,0,0]
[39,12.55,2.02,0,0]
[40,12.73,2.06,0,0]
[41,12.92,2.06,0,0]
[42,13.1,2.09,0,0]
[43,13.29,2.12,0,0]
[44,13.49,2.12,0,0]
[45,13.68,2.16,0,0]
[46,13.88,2.16,0,0]
[47,14.08,2.19,0,0]
[48,14.28,2.2200000000000002,0,0]
[49,14.48,2.25,0,0]
[50,14.69,2.25,0,0]
[51,14.91,2.25,0,0]
[52,15.12,2.29,0,0]
[53,15.34,2.29,0,0]
[54,15.56,2.3199999999999998,0,0]
[55,15.79,2.3199999999999998,0,0]
[56,16.02,2.3199999999999998,0,0]
[57,16.260000000000002,2.3199999999999998,0,0]
[58,16.510000000000002,2.3199999999999998,0,0]
[59,16.760000000000002,2.3199999999999998,0,0]
[60,17.02,2.3199999999999998,0,0]
[61,17.29,2.35,0,0]
[62,17.579999999999998,2.3199999999999998,0,0]
[63,17.88,2.3199999999999998,0,0]
[64,18.2,2.29,0,0]
[65,18.55,2.25,0,0]
[66,18.309999999999999,2.27,0,0]
[67,17.64,2.2599999999999998,0,0]
[68,16.96,2.2400000000000002,0,0]
[69,16.28,2.11,0,0]
[70,15.6,1.98,0,0]
[71,14.92,1.96,0,0]
[72,14.25,1.94,0,0]
[73,13.59,1.92,0,0]
[74,12.94,1.77,0,0]

{"sheet":"x-212","index":23,"n_rows":84,"n_cols":5,"rows_kept":84,"cut":false,"hidden":false,"merged":[]}
["Government Actuary's Department"]
["LGPS_EW - Consolidated Factor Spreadsheet"]
["TV In (non-club) - x-212"]
[]
[]
["Data Item","Factor Table Information"]
["Scheme","LGPS_EW"]
["Section","All"]
["Factor Type","TV In (non-club)"]
["Description","Factors for non-club transfers-in based on NPA 66 - Females (NPA66)"]
["Gender","Female"]
["Factor Age/Period Definition","Age last birthday at relevant date"]
["Section Number",0]
["Series Number",212]
["Table Reference","0-212"]
["Table Reference in Guidance","Table NF66"]
["Related Factor Guidance Note","LGPS EW Individual Transfers 8 April 2020"]
["Date Factors Issued to Client","2023-06-30"]
["Date Factors Implemented (if known)","2023-07-03"]
["Factor Status","Issued"]
[]
[null,{"$f":"HYPERLINK(\"#'Factor List'!A1\",\"Back to Factor List\")","v":"Back to Factor List"}]
[]
[]
["Age","Gross Pension of £1 pa","Surviving Partner's Pension of £1 pa","Adjustment for GMP of £1 pa - Pre-88","Adjustment for GMP of £1 pa - Post-88"]
[16,8.98,1.34,0,0]
[17,9.11,1.4,0,0]
[18,9.24,1.5,0,0]
[19,9.3800000000000008,1.53,0,0]
[20,9.52,1.57,0,0]
[21,9.66,1.57,0,0]
[22,9.8000000000000007,1.6,0,0]
[23,9.9499999999999993,1.6,0,0]
[24,10.09,1.67,0,0]
[25,10.24,1.67,0,0]
[26,10.39,1.7,0,0]
[27,10.55,1.7,0,0]
[28,10.7,1.73,0,0]
[29,10.86,1.76,0,0]
[30,11.02,1.8,0,0]
[31,11.18,1.8,0,0]
[32,11.34,1.86,0,0]
[33,11.51,1.86,0,0]
[34,11.68,1.86,0,0]
[35,11.85,1.89,0,0]
[36,12.02,1.93,0,0]
[37,12.19,1.96,0,0]
[38,12.37,1.99,0,0]
[39,12.55,2.02,0,0]
[40,12.73,2.06,0,0]
[41,12.92,2.06,0,0]
[42,13.1,2.09,0,0]
[43,13.29,2.12,0,0]
[44,13.49,2.12,0,0]
[45,13.68,2.16,0,0]
[46,13.88,2.16,0,0]
[47,14.08,2.19,0,0]
[48,14.28,2.2200000000000002,0,0]
[49,14.48,2.25,0,0]
[50,14.69,2.25,0,0]
[51,14.91,2.25,0,0]
[52,15.12,2.29,0,0]
[53,15.34,2.29,0,0]
[54,15.56,2.3199999999999998,0,0]
[55,15.79,2.3199999999999998,0,0]
[56,16.02,2.3199999999999998,0,0]
[57,16.260000000000002,2.3199999999999998,0,0]
[58,16.510000000000002,2.3199999999999998,0,0]
[59,16.760000000000002,2.3199999999999998,0,0]
[60,17.02,2.3199999999999998,0,0]
[61,17.29,2.35,0,0]
[62,17.579999999999998,2.3199999999999998,0,0]
[63,17.88,2.3199999999999998,0,0]
[64,18.2,2.29,0,0]
[65,18.55,2.25,0,0]
[66,18.309999999999999,2.27,0,0]
[67,17.64,2.2599999999999998,0,0]
[68,16.96,2.2400000000000002,0,0]
[69,16.28,2.11,0,0]
[70,15.6,1.98,0,0]
[71,14.92,1.96,0,0]
[72,14.25,1.94,0,0]
[73,13.59,1.92,0,0]
[74,12.94,1.77,0,0]

{"sheet":"x-213","index":24,"n_rows":84,"n_cols":5,"rows_kept":84,"cut":false,"hidden":false,"merged":[]}
["Government Actuary's Department"]
[{"$f":"IF(TITLE=\"> Enter workbook title here\",\"Enter workbook title in Cover sheet\",TITLE)","v":"Local Government Pension Scheme (LGPS) - Consolidated Factor Spreadsheet"}]
["TV In (non-club) - x-213"]
[]
[]
["Data Item","Factor Table Information"]
["Scheme","LGPS_EW"]
["Section","All"]
["Factor Type","TV In (non-club)"]
["Description","Factors for non-club transfers-in based on NPA 67 - Males (NPA67)"]
["Gender","Male"]
["Factor Age/Period Definition","Age last birthday at relevant date"]
["Section Number",0]
["Series Number",213]
["Table Reference","0-213"]
["Table Reference in Guidance","Table NM67"]
["Related Factor Guidance Note","LGPS EW Individual Transfers 8 April 2020"]
["Date Factors Issued to Client","2023-06-30"]
["Date Factors Implemented (if known)","2023-07-03"]
["Factor Status","Issued"]
[]
[null,{"$f":"HYPERLINK(\"#'Factor List'!A1\",\"Back to Factor List\")","v":"Back to Factor List"}]
[]
[]
["Age","Gross Pension of £1 pa","Surviving Partner's Pension of £1 pa","Adjustment for GMP of £1 pa - Pre-88","Adjustment for GMP of £1 pa - Post-88"]
[16,8.6,1.34,0,0]
[17,8.7200000000000006,1.44,0,0]
[18,8.85,1.5,0,0]
[19,8.98,1.57,0,0]
[20,9.1199999999999992,1.57,0,0]
[21,9.25,1.6,0,0]
[22,9.39,1.6,0,0]
[23,9.52,1.63,0,0]
[24,9.66,1.67,0,0]
[25,9.8000000000000007,1.7,0,0]
[26,9.9499999999999993,1.7,0,0]
[27,10.09,1.73,0,0]
[28,10.24,1.76,0,0]
[29,10.39,1.8,0,0]
[30,10.54,1.8,0,0]
[31,10.7,1.83,0,0]
[32,10.85,1.86,0,0]
[33,11.01,1.86,0,0]
[34,11.17,1.89,0,0]
[35,11.33,1.93,0,0]
[36,11.49,1.96,0,0]
[37,11.66,1.99,0,0]
[38,11.83,1.99,0,0]
[39,12,2.02,0,0]
[40,12.17,2.06,0,0]
[41,12.35,2.06,0,0]
[42,12.53,2.09,0,0]
[43,12.71,2.12,0,0]
[44,12.89,2.12,0,0]
[45,13.07,2.19,0,0]
[46,13.26,2.19,0,0]
[47,13.45,2.19,0,0]
[48,13.64,2.2200000000000002,0,0]
[49,13.83,2.25,0,0]
[50,14.03,2.25,0,0]
[51,14.23,2.29,0,0]
[52,14.43,2.3199999999999998,0,0]
[53,14.64,2.3199999999999998,0,0]
[54,14.85,2.3199999999999998,0,0]
[55,15.06,2.35,0,0]
[56,15.28,2.35,0,0]
[57,15.5,2.35,0,0]
[58,15.73,2.35,0,0]
[59,15.97,2.3199999999999998,0,0]
[60,16.21,2.35,0,0]
[61,16.46,2.35,0,0]
[62,16.72,2.35,0,0]
[63,17,2.3199999999999998,0,0]
[64,17.29,2.3199999999999998,0,0]
[65,17.61,2.29,0,0]
[66,17.95,2.29,0,0]
[67,17.64,2.2599999999999998,0,0]
[68,16.96,2.2400000000000002,0,0]
[69,16.28,2.11,0,0]
[70,15.6,1.98,0,0]
[71,14.92,1.96,0,0]
[72,14.25,1.94,0,0]
[73,13.59,1.92,0,0]
[74,12.94,1.77,0,0]

{"sheet":"x-214","index":25,"n_rows":84,"n_cols":5,"rows_kept":84,"cut":false,"hidden":false,"merged":[]}
["Government Actuary's Department"]
["LGPS_EW - Consolidated Factor Spreadsheet"]
["TV In (non-club) - x-214"]
[]
[]
["Data Item","Factor Table Information"]
["Scheme","LGPS_EW"]
["Section","All"]
["Factor Type","TV In (non-club)"]
["Description","Factors for non-club transfers-in based on NPA 67 - Females (NPA67)"]
["Gender","Female"]
["Factor Age/Period Definition","Age last birthday at relevant date"]
["Section Number",0]
["Series Number",214]
["Table Reference","0-214"]
["Table Reference in Guidance","Table NF67"]
["Related Factor Guidance Note","LGPS EW Individual Transfers 8 April 2020"]
["Date Factors Issued to Client","2023-06-30"]
["Date Factors Implemented (if known)","2023-07-03"]
["Factor Status","Issued"]
[]
[null,{"$f":"HYPERLINK(\"#'Factor List'!A1\",\"Back to Factor List\")","v":"Back to Factor List"}]
[]
[]
["Age","Gross Pension of £1 pa","Surviving Partner's Pension of £1 pa","Adjustment for GMP of £1 pa - Pre-88","Adjustment for GMP of £1 pa - Post-88"]
[16,8.6,1.34,0,0]
[17,8.7200000000000006,1.44,0,0]
[18,8.85,1.5,0,0]
[19,8.98,1.57,0,0]
[20,9.1199999999999992,1.57,0,0]
[21,9.25,1.6,0,0]
[22,9.39,1.6,0,0]
[23,9.52,1.63,0,0]
[24,9.66,1.67,0,0]
[25,9.8000000000000007,1.7,0,0]
[26,9.9499999999999993,1.7,0,0]
[27,10.09,1.73,0,0]
[28,10.24,1.76,0,0]
[29,10.39,1.8,0,0]
[30,10.54,1.8,0,0]
[31,10.7,1.83,0,0]
[32,10.85,1.86,0,0]
[33,11.01,1.86,0,0]
[34,11.17,1.89,0,0]
[35,11.33,1.93,0,0]
[36,11.49,1.96,0,0]
[37,11.66,1.99,0,0]
[38,11.83,1.99,0,0]
[39,12,2.02,0,0]
[40,12.17,2.06,0,0]
[41,12.35,2.06,0,0]
[42,12.53,2.09,0,0]
[43,12.71,2.12,0,0]
[44,12.89,2.12,0,0]
[45,13.07,2.19,0,0]
[46,13.26,2.19,0,0]
[47,13.45,2.19,0,0]
[48,13.64,2.2200000000000002,0,0]
[49,13.83,2.25,0,0]
[50,14.03,2.25,0,0]
[51,14.23,2.29,0,0]
[52,14.43,2.3199999999999998,0,0]
[53,14.64,2.3199999999999998,0,0]
[54,14.85,2.3199999999999998,0,0]
[55,15.06,2.35,0,0]
[56,15.28,2.35,0,0]
[57,15.5,2.35,0,0]
[58,15.73,2.35,0,0]
[59,15.97,2.3199999999999998,0,0]
[60,16.21,2.35,0,0]
[61,16.46,2.35,0,0]
[62,16.72,2.35,0,0]
[63,17,2.3199999999999998,0,0]
[64,17.29,2.3199999999999998,0,0]
[65,17.61,2.29,0,0]
[66,17.95,2.29,0,0]
[67,17.64,2.2599999999999998,0,0]
[68,16.96,2.2400000000000002,0,0]
[69,16.28,2.11,0,0]
[70,15.6,1.98,0,0]
[71,14.92,1.96,0,0]
[72,14.25,1.94,0,0]
[73,13.59,1.92,0,0]
[74,12.94,1.77,0,0]

{"sheet":"x-215","index":26,"n_rows":84,"n_cols":5,"rows_kept":84,"cut":false,"hidden":false,"merged":[]}
["Government Actuary's Department"]
["LGPS_EW - Consolidated Factor Spreadsheet"]
["TV In (non-club) - x-215"]
[]
[]
["Data Item","Factor Table Information"]
["Scheme","LGPS_EW"]
["Section","All"]
["Factor Type","TV In (non-club)"]
["Description","Factors for non-club transfers-in based on NPA 68 - Males (NPA68)"]
["Gender","Male"]
["Factor Age/Period Definition","Age last birthday at relevant date"]
["Section Number",0]
["Series Number",215]
["Table Reference","0-215"]
["Table Reference in Guidance","Table NM68"]
["Related Factor Guidance Note","LGPS EW Individual Transfers 8 April 2020"]
["Date Factors Issued to Client","2023-06-30"]
["Date Factors Implemented (if known)","2023-07-03"]
["Factor Status","Issued"]
[]
[null,{"$f":"HYPERLINK(\"#'Factor List'!A1\",\"Back to Factor List\")","v":"Back to Factor List"}]
[]
[]
["Age","Gross Pension of £1 pa","Surviving Partner's Pension of £1 pa","Adjustment for GMP of £1 pa - Pre-88","Adjustment for GMP of £1 pa - Post-88"]
[16,8.23,1.37,0,0]
[17,8.35,1.44,0,0]
[18,8.4700000000000006,1.5,0,0]
[19,8.6,1.57,0,0]
[20,8.73,1.57,0,0]
[21,8.85,1.6,0,0]
[22,8.98,1.63,0,0]
[23,9.11,1.67,0,0]
[24,9.25,1.67,0,0]
[25,9.3800000000000008,1.7,0,0]
[26,9.52,1.73,0,0]
[27,9.66,1.73,0,0]
[28,9.8000000000000007,1.76,0,0]
[29,9.94,1.8,0,0]
[30,10.08,1.83,0,0]
[31,10.23,1.86,0,0]
[32,10.38,1.86,0,0]
[33,10.53,1.89,0,0]
[34,10.68,1.93,0,0]
[35,10.83,1.96,0,0]
[36,10.99,1.96,0,0]
[37,11.15,1.99,0,0]
[38,11.31,2.02,0,0]
[39,11.47,2.06,0,0]
[40,11.64,2.06,0,0]
[41,11.8,2.09,0,0]
[42,11.97,2.12,0,0]
[43,12.14,2.16,0,0]
[44,12.31,2.19,0,0]
[45,12.49,2.19,0,0]
[46,12.67,2.19,0,0]
[47,12.85,2.2200000000000002,0,0]
[48,13.03,2.2200000000000002,0,0]
[49,13.21,2.25,0,0]
[50,13.39,2.29,0,0]
[51,13.58,2.29,0,0]
[52,13.77,2.3199999999999998,0,0]
[53,13.97,2.3199999999999998,0,0]
[54,14.16,2.35,0,0]
[55,14.36,2.35,0,0]
[56,14.57,2.35,0,0]
[57,14.77,2.38,0,0]
[58,14.99,2.35,0,0]
[59,15.2,2.38,0,0]
[60,15.43,2.35,0,0]
[61,15.66,2.35,0,0]
[62,15.9,2.35,0,0]
[63,16.149999999999999,2.35,0,0]
[64,16.420000000000002,2.35,0,0]
[65,16.71,2.3199999999999998,0,0]
[66,17.02,2.29,0,0]
[67,17.36,2.25,0,0]
[68,16.96,2.2400000000000002,0,0]
[69,16.28,2.11,0,0]
[70,15.6,1.98,0,0]
[71,14.92,1.96,0,0]
[72,14.25,1.94,0,0]
[73,13.59,1.92,0,0]
[74,12.94,1.77,0,0]

{"sheet":"x-216","index":27,"n_rows":84,"n_cols":5,"rows_kept":84,"cut":false,"hidden":false,"merged":[]}
["Government Actuary's Department"]
["LGPS_EW - Consolidated Factor Spreadsheet"]
["TV In (non-club) - x-216"]
[]
[]
["Data Item","Factor Table Information"]
["Scheme","LGPS_EW"]
["Section","All"]
["Factor Type","TV In (non-club)"]
["Description","Factors for non-club transfers-in based on NPA 68 - Females (NPA68)"]
["Gender","Female"]
["Factor Age/Period Definition","Age last birthday at relevant date"]
["Section Number",0]
["Series Number",216]
["Table Reference","0-216"]
["Table Reference in Guidance","Table NF68"]
["Related Factor Guidance Note","LGPS EW Individual Transfers 8 April 2020"]
["Date Factors Issued to Client","2023-06-30"]
["Date Factors Implemented (if known)","2023-07-03"]
["Factor Status","Issued"]
[]
[null,{"$f":"HYPERLINK(\"#'Factor List'!A1\",\"Back to Factor List\")","v":"Back to Factor List"}]
[]
[]
["Age","Gross Pension of £1 pa","Surviving Partner's Pension of £1 pa","Adjustment for GMP of £1 pa - Pre-88","Adjustment for GMP of £1 pa - Post-88"]
[16,8.23,1.37,0,0]
[17,8.35,1.44,0,0]
[18,8.4700000000000006,1.5,0,0]
[19,8.6,1.57,0,0]
[20,8.73,1.57,0,0]
[21,8.85,1.6,0,0]
[22,8.98,1.63,0,0]
[23,9.11,1.67,0,0]
[24,9.25,1.67,0,0]
[25,9.3800000000000008,1.7,0,0]
[26,9.52,1.73,0,0]
[27,9.66,1.73,0,0]
[28,9.8000000000000007,1.76,0,0]
[29,9.94,1.8,0,0]
[30,10.08,1.83,0,0]
[31,10.23,1.86,0,0]
[32,10.38,1.86,0,0]
[33,10.53,1.89,0,0]
[34,10.68,1.93,0,0]
[35,10.83,1.96,0,0]
[36,10.99,1.96,0,0]
[37,11.15,1.99,0,0]
[38,11.31,2.02,0,0]
[39,11.47,2.06,0,0]
[40,11.64,2.06,0,0]
[41,11.8,2.09,0,0]
[42,11.97,2.12,0,0]
[43,12.14,2.16,0,0]
[44,12.31,2.19,0,0]
[45,12.49,2.19,0,0]
[46,12.67,2.19,0,0]
[47,12.85,2.2200000000000002,0,0]
[48,13.03,2.2200000000000002,0,0]
[49,13.21,2.25,0,0]
[50,13.39,2.29,0,0]
[51,13.58,2.29,0,0]
[52,13.77,2.3199999999999998,0,0]
[53,13.97,2.3199999999999998,0,0]
[54,14.16,2.35,0,0]
[55,14.36,2.35,0,0]
[56,14.57,2.35,0,0]
[57,14.77,2.38,0,0]
[58,14.99,2.35,0,0]
[59,15.2,2.38,0,0]
[60,15.43,2.35,0,0]
[61,15.66,2.35,0,0]
[62,15.9,2.35,0,0]
[63,16.149999999999999,2.35,0,0]
[64,16.420000000000002,2.35,0,0]
[65,16.71,2.3199999999999998,0,0]
[66,17.02,2.29,0,0]
[67,17.36,2.25,0,0]
[68,16.96,2.2400000000000002,0,0]
[69,16.28,2.11,0,0]
[70,15.6,1.98,0,0]
[71,14.92,1.96,0,0]
[72,14.25,1.94,0,0]
[73,13.59,1.92,0,0]
[74,12.94,1.77,0,0]

{"sheet":"x-217","index":28,"n_rows":84,"n_cols":5,"rows_kept":84,"cut":false,"hidden":false,"merged":[]}
["Government Actuary's Department"]
[{"$f":"IF(TITLE=\"> Enter workbook title here\",\"Enter workbook title in Cover sheet\",TITLE)","v":"Local Government Pension Scheme (LGPS) - Consolidated Factor Spreadsheet"}]
[{"$f":"TABLE_FACTOR_TYPE&\" - x-\"&TABLE_SERIES_NUMBER","v":"TV In (non-club) - x-217"}]
[]
[]
["Data Item","Factor Table Information"]
["Scheme","LGPS_EW"]
["Section","All"]
["Factor Type","TV In (non-club)"]
["Description","Factors for Non-Club Transfer with Final Salary link"]
["Gender","Unisex"]
["Factor Age/Period Definition","Age last birthday at relevant date"]
["Section Number",0]
["Series Number",217]
["Table Reference","0-217"]
["Table Reference in Guidance","Table NUFS"]
["Related Factor Guidance Note","LGPS EW Individual Transfers 8 April 2020"]
["Date Factors Issued to Client","2023-06-30"]
["Date Factors Implemented (if known)","2023-07-03"]
["Factor Status","Issued"]
[]
[null,{"$f":"HYPERLINK(\"#'Factor List'!A1\",\"Back to Factor List\")","v":"Back to Factor List"}]
[]
[]
["Age","Gross Pension of £1 pa","Surviving Partner's Pension of £1 pa","Adjustment for GMP of £1 pa - Pre-88","Adjustment for GMP of £1 pa - Post-88"]
[16,25.4,3.39,0,0]
[17,25.33,3.5,0,0]
[18,25.26,3.64,0,0]
[19,25.16,3.73,0,0]
[20,25.02,3.71,0,0]
[21,24.89,3.69,0,0]
[22,24.75,3.69,0,0]
[23,24.62,3.67,0,0]
[24,24.38,3.63,0,0]
[25,24.04,3.58,0,0]
[26,23.71,3.53,0,0]
[27,23.39,3.48,0,0]
[28,23.08,3.42,0,0]
[29,22.81,3.38,0,0]
[30,22.58,3.35,0,0]
[31,22.36,3.31,0,0]
[32,22.13,3.28,0,0]
[33,21.92,3.24,0,0]
[34,21.73,3.21,0,0]
[35,21.57,3.19,0,0]
[36,21.41,3.16,0,0]
[37,21.25,3.14,0,0]
[38,21.1,3.1,0,0]
[39,20.95,3.08,0,0]
[40,20.81,3.06,0,0]
[41,20.68,3.03,0,0]
[42,20.54,3.01,0,0]
[43,20.41,2.98,0,0]
[44,20.29,2.95,0,0]
[45,20.170000000000002,2.92,0,0]
[46,20.05,2.9,0,0]
[47,19.93,2.87,0,0]
[48,19.809999999999999,2.85,0,0]
[49,19.73,2.82,0,0]
[50,19.68,2.8,0,0]
[51,19.63,2.78,0,0]
[52,19.579999999999998,2.75,0,0]
[53,19.54,2.72,0,0]
[54,19.489999999999998,2.7,0,0]
[55,19.45,2.67,0,0]
[56,19.41,2.64,0,0]
[57,19.38,2.6,0,0]
[58,19.34,2.58,0,0]
[59,19.32,2.5299999999999998,0,0]
[60,19.3,2.4900000000000002,0,0]
[61,19.29,2.4500000000000002,0,0]
[62,19.28,2.41,0,0]
[63,19.29,2.35,0,0]
[64,19.309999999999999,2.2999999999999998,0,0]
[65,19.02,2.2799999999999998,0,0]
[66,18.43,2.2599999999999998,0,0]
[67,17.829999999999998,2.2599999999999998,0,0]
[68,17.239999999999998,2.25,0,0]
[69,16.66,2.11,0,0]
[70,16.079999999999998,1.97,0,0]
[71,15.51,1.96,0,0]
[72,14.95,1.94,0,0]
[73,14.4,1.92,0,0]
[74,14.13,1.91,0,0]

{"sheet":"x-219","index":29,"n_rows":31,"n_cols":4,"rows_kept":31,"cut":false,"hidden":false,"merged":[]}
["Government Actuary's Department"]
[{"$f":"IF(TITLE=\"> Enter workbook title here\",\"Enter workbook title in Cover sheet\",TITLE)","v":"Local Government Pension Scheme (LGPS) - Consolidated Factor Spreadsheet"}]
[{"$f":"TABLE_FACTOR_TYPE&\" - x-\"&TABLE_SERIES_NUMBER","v":"CETV - x-219"}]
[]
[]
["Data Item","Factor Table Information"]
["Scheme","LGPS_EW"]
["Section","All"]
["Factor Type","CETV"]
["Description","CRA Conversion Factors - Pension and Lump Sum Conversion Factors"]
["Gender","Male and Female"]
["Factor Age/Period Definition","Relevant Period (years)"]
["Section Number",0]
["Series Number",219]
["Table Reference","0-219"]
["Table Reference in Guidance","Table 17"]
["Related Factor Guidance Note","LGPS EW Individual Transfers 8 April 2020"]
["Date Factors Issued to Client","2023-05-25"]
["Date Factors Implemented (if known)","2023-06-01"]
["Factor Status","Issued"]
[]
[null,{"$f":"HYPERLINK(\"#'Factor List'!A1\",\"Back to Factor List\")","v":"Back to Factor List"}]
[]
[]
["Years Early","Personal Pension (Male)","Personal Pension (Female)","Lump Sum (Both sexes)"]
[0,1,1,1]
[1,1.05,1.05,1.02]
[2,1.1000000000000001,1.1000000000000001,1.03]
[3,1.1599999999999999,1.1599999999999999,1.05]
[4,1.21,1.21,1.07]
[5,1.26,1.26,1.0900000000000001]

{"sheet":"x-301","index":30,"n_rows":71,"n_cols":5,"rows_kept":71,"cut":false,"hidden":false,"merged":[]}
["Government Actuary's Department"]
[{"$f":"IF(TITLE=\"> Enter workbook title here\",\"Enter workbook title in Cover sheet\",TITLE)","v":"Local Government Pension Scheme (LGPS) - Consolidated Factor Spreadsheet"}]
[{"$f":"TABLE_FACTOR_TYPE&\" - x-\"&TABLE_SERIES_NUMBER","v":"Pensioner CE - x-301"}]
[]
[]
["Data Item","Factor Table Information"]
["Scheme","LGPS_EW"]
["Section","All"]
["Factor Type","Pensioner CE"]
["Description","Pensioner cash equivalent factors on divorce - non ill health cases"]
["Gender","Male"]
["Factor Age/Period Definition","Age last birthday at relevant date"]
["Section Number",0]
["Series Number",301]
["Table Reference","0-301"]
["Table Reference in Guidance","Table 1.1"]
["Related Factor Guidance Note","LGPS EW Pensioner CE factors on divorce 11 June 2020"]
["Date Factors Issued to Client","2023-05-25"]
["Date Factors Implemented (if known)","2023-06-01"]
["Factor Status","Issued"]
[]
[null,{"$f":"HYPERLINK(\"#'Factor List'!A1\",\"Back to Factor List\")","v":"Back to Factor List"}]
[]
[]
["Age","Member's pension of £1 per annum","Surviving partner's pension of £1 per annum ","Deduction for GMP of £1 per annum","Deduction for NI modification of £1 per annum"]
[55,24.92,2.21,null,0]
[56,24.35,2.23,null,0]
[57,23.77,2.2400000000000002,null,0]
[58,23.18,2.25,null,0]
[59,22.6,2.2599999999999998,null,0]
[60,22,2.27,null,0]
[61,21.41,2.2799999999999998,null,0]
[62,20.81,2.2799999999999998,null,0]
[63,20.22,2.2799999999999998,null,0]
[64,19.62,2.2799999999999998,null,0]
[65,18.989999999999998,2.27]
[66,18.309999999999999,2.27]
[67,17.64,2.2599999999999998]
[68,16.96,2.2400000000000002]
[69,16.28,2.11,3.14]
[70,15.6,1.98,2.92]
[71,14.92,1.96,2.72]
[72,14.25,1.94,2.52]
[73,13.59,1.92,2.33]
[74,12.94,1.77,2.13]
[75,12.3,1.63,1.94]
[76,11.67,1.6,1.78]
[77,11.05,1.58,1.62]
[78,10.44,1.54,1.47]
[79,9.83,1.37,1.31]
[80,9.24,1.2,1.17]
[81,8.67,1.17,1.05]
[82,8.11,1.1299999999999999,0.94]
[83,7.57,1.1000000000000001,0.84]
[84,7.05,0.94,0.73]
[85,6.55,0.78,0.63]
[86,6.07,0.75,0.55000000000000004]
[87,5.62,0.71,0.49]
[88,5.2,0.68,0.43]
[89,4.8,0.54,0.36]
[90,4.43,0.41,0.3]
[91,4.09,0.39,0.26]
[92,3.77,0.37,0.23]
[93,3.49,0.34,0.2]
[94,3.23,0.32,0.17]
[95,2.99,0.3,0.15]
[96,2.78,0.28000000000000003,0.13]
[97,2.6,0.26,0.12]
[98,2.44,0.25,0.11]
[99,2.31,0.23,0.1]
[100,2.21,0.22,0.09]

{"sheet":"x-302","index":31,"n_rows":71,"n_cols":5,"rows_kept":71,"cut":false,"hidden":false,"merged":[]}
["Government Actuary's Department"]
[{"$f":"IF(TITLE=\"> Enter workbook title here\",\"Enter workbook title in Cover sheet\",TITLE)","v":"Local Government Pension Scheme (LGPS) - Consolidated Factor Spreadsheet"}]
[{"$f":"TABLE_FACTOR_TYPE&\" - x-\"&TABLE_SERIES_NUMBER","v":"Pensioner CE - x-302"}]
[]
[]
["Data Item","Factor Table Information"]
["Scheme","LGPS_EW"]
["Section","All"]
["Factor Type","Pensioner CE"]
["Description","Pensioner cash equivalent factors on divorce - non ill health cases"]
["Gender","Female"]
["Factor Age/Period Definition","Age last birthday at relevant date"]
["Section Number",0]
["Series Number",302]
["Table Reference","0-302"]
["Table Reference in Guidance","Table 1.2"]
["Related Factor Guidance Note","LGPS EW Pensioner CE factors on divorce 11 June 2020"]
["Date Factors Issued to Client","2023-05-25"]
["Date Factors Implemented (if known)","2023-06-01"]
["Factor Status","Issued"]
[]
[null,{"$f":"HYPERLINK(\"#'Factor List'!A1\",\"Back to Factor List\")","v":"Back to Factor List"}]
[]
[]
["Age","Member's pension of £1 per annum","Surviving partner's pension of £1 per annum ","Deduction for GMP of £1 per annum","Deduction for NI modification of £1 per annum"]
[55,24.92,2.21,null,0]
[56,24.35,2.23,null,0]
[57,23.77,2.2400000000000002,null,0]
[58,23.18,2.25,null,0]
[59,22.6,2.2599999999999998,null,0]
[60,22,2.27,null,0]
[61,21.41,2.2799999999999998,null,0]
[62,20.81,2.2799999999999998,null,0]
[63,20.22,2.2799999999999998,null,0]
[64,19.62,2.2799999999999998,null,0]
[65,18.989999999999998,2.27]
[66,18.309999999999999,2.27]
[67,17.64,2.2599999999999998]
[68,16.96,2.2400000000000002]
[69,16.28,2.11,3.02]
[70,15.6,1.98,2.81]
[71,14.92,1.96,2.61]
[72,14.25,1.94,2.41]
[73,13.59,1.92,2.23]
[74,12.94,1.77,2.04]
[75,12.3,1.63,1.87]
[76,11.67,1.6,1.71]
[77,11.05,1.58,1.55]
[78,10.44,1.54,1.4]
[79,9.83,1.37,1.26]
[80,9.24,1.2,1.1299999999999999]
[81,8.67,1.17,1.01]
[82,8.11,1.1299999999999999,0.9]
[83,7.57,1.1000000000000001,0.8]
[84,7.05,0.94,0.7]
[85,6.55,0.78,0.62]
[86,6.07,0.75,0.54]
[87,5.62,0.71,0.47]
[88,5.2,0.68,0.41]
[89,4.8,0.54,0.36]
[90,4.43,0.41,0.31]
[91,4.09,0.39,0.27]
[92,3.77,0.37,0.23]
[93,3.49,0.34,0.2]
[94,3.23,0.32,0.18]
[95,2.99,0.3,0.15]
[96,2.78,0.28000000000000003,0.13]
[97,2.6,0.26,0.12]
[98,2.44,0.25,0.11]
[99,2.31,0.23,0.1]
[100,2.21,0.22,0.09]

{"sheet":"x-303","index":32,"n_rows":101,"n_cols":5,"rows_kept":101,"cut":false,"hidden":false,"merged":[]}
["Government Actuary's Department"]
[{"$f":"IF(TITLE=\"> Enter workbook title here\",\"Enter workbook title in Cover sheet\",TITLE)","v":"Local Government Pension Scheme (LGPS) - Consolidated Factor Spreadsheet"}]
[{"$f":"TABLE_FACTOR_TYPE&\" - x-\"&TABLE_SERIES_NUMBER","v":"Pensioner CE - x-303"}]
[]
[]
["Data Item","Factor Table Information"]
["Scheme","LGPS_EW"]
["Section","All"]
["Factor Type","Pensioner CE"]
["Description","Ill health pensioner cash equivalent factors on divorce"]
["Gender","Male"]
["Factor Age/Period Definition","Age last birthday at relevant date"]
["Section Number",0]
["Series Number",303]
["Table Reference","0-303"]
["Table Reference in Guidance","Table 2.1"]
["Related Factor Guidance Note","LGPS EW Pensioner CE factors on divorce 11 June 2020"]
["Date Factors Issued to Client","2023-05-25"]
["Date Factors Implemented (if known)","2023-06-01"]
["Factor Status","Issued"]
[]
[null,{"$f":"HYPERLINK(\"#'Factor List'!A1\",\"Back to Factor List\")","v":"Back to Factor List"}]
[]
[]
["Age","Member's pension of £1 per annum","Surviving partner's pension of £1 per annum ","Deduction for GMP of £1 per annum","Deduction for NI modification of £1 per annum"]
[20,30.94,7.87,null,0]
[21,30.7,7.81,null,0]
[22,30.47,7.73,null,0]
[23,30.24,7.65,null,0]
[24,30,7.57,null,0]
[25,29.76,7.49,null,0]
[26,29.52,7.41,null,0]
[27,29.28,7.32,null,0]
[28,29.04,7.22,null,0]
[29,28.81,7.12,null,0]
[30,28.58,7.01,null,0]
[31,28.35,6.9,null,0]
[32,28.12,6.78,null,0]
[33,27.89,6.66,null,0]
[34,27.66,6.53,null,0]
[35,27.43,6.41,null,0]
[36,27.19,6.28,null,0]
[37,26.95,6.15,null,0]
[38,26.7,6.01,null,0]
[39,26.44,5.89,null,0]
[40,26.18,5.76,null,0]
[41,25.91,5.63,null,0]
[42,25.63,5.5,null,0]
[43,25.34,5.38,null,0]
[44,25.04,5.25,null,0]
[45,24.74,5.12,null,0]
[46,24.43,5,null,0]
[47,24.11,4.88,null,0]
[48,23.78,4.76,null,0]
[49,23.43,4.6399999999999997,null,0]
[50,23.08,4.5199999999999996,null,0]
[51,22.71,4.42,null,0]
[52,22.32,4.3099999999999996,null,0]
[53,21.92,4.21,null,0]
[54,21.5,4.12,null,0]
[55,21.07,4.0199999999999996,null,0]
[56,20.63,3.94,null,0]
[57,20.170000000000002,3.85,null,0]
[58,19.71,3.77,null,0]
[59,19.22,3.7,null,0]
[60,18.73,3.63,null,0]
[61,18.21,3.56,null,0]
[62,17.690000000000001,3.5,null,0]
[63,17.149999999999999,3.44,null,0]
[64,16.61,3.38,null,0]
[65,16.05,3.33]
[66,15.47,3.28]
[67,14.89,3.23]
[68,14.31,3.18]
[69,13.71,2.96,2.65]
[70,13.11,2.74,2.46]
[71,12.51,2.7,2.2799999999999998]
[72,11.91,2.66,2.11]
[73,11.32,2.61,1.94]
[74,10.72,2.4,1.76]
[75,10.14,2.19,1.6]
[76,9.56,2.14,1.45]
[77,9,2.09,1.32]
[78,8.4499999999999993,2.0299999999999998,1.2]
[79,7.92,1.79,1.06]
[80,7.4,1.54,0.93]
[81,6.9,1.49,0.83]
[82,6.43,1.44,0.74]
[83,5.97,1.38,0.66]
[84,5.54,1.1599999999999999,0.56999999999999995]
[85,5.13,0.95,0.49]
[86,4.74,0.91,0.43]
[87,4.37,0.86,0.38]
[88,4.03,0.82,0.33]
[89,3.71,0.64,0.28000000000000003]
[90,3.41,0.48,0.23]
[91,3.13,0.45,0.2]
[92,2.88,0.42,0.17]
[93,2.65,0.39,0.15]
[94,2.44,0.37,0.13]
[95,2.25,0.34,0.11]

{"sheet":"x-304","index":33,"n_rows":101,"n_cols":5,"rows_kept":101,"cut":false,"hidden":false,"merged":[]}
["Government Actuary's Department"]
[{"$f":"IF(TITLE=\"> Enter workbook title here\",\"Enter workbook title in Cover sheet\",TITLE)","v":"Local Government Pension Scheme (LGPS) - Consolidated Factor Spreadsheet"}]
[{"$f":"TABLE_FACTOR_TYPE&\" - x-\"&TABLE_SERIES_NUMBER","v":"Pensioner CE - x-304"}]
[]
[]
["Data Item","Factor Table Information"]
["Scheme","LGPS_EW"]
["Section","All"]
["Factor Type","Pensioner CE"]
["Description","Ill health pensioner cash equivalent factors on divorce"]
["Gender","Female"]
["Factor Age/Period Definition","Age last birthday at relevant date"]
["Section Number",0]
["Series Number",304]
["Table Reference","0-304"]
["Table Reference in Guidance","Table 2.2"]
["Related Factor Guidance Note","LGPS EW Pensioner CE factors on divorce 11 June 2020"]
["Date Factors Issued to Client","2023-05-25"]
["Date Factors Implemented (if known)","2023-06-01"]
["Factor Status","Issued"]
[]
[null,{"$f":"HYPERLINK(\"#'Factor List'!A1\",\"Back to Factor List\")","v":"Back to Factor List"}]
[]
[]
["Age","Member's pension of £1 per annum","Surviving partner's pension of £1 per annum ","Deduction for GMP of £1 per annum","Deduction for NI modification of £1 per annum"]
[20,30.94,7.87,null,0]
[21,30.7,7.81,null,0]
[22,30.47,7.73,null,0]
[23,30.24,7.65,null,0]
[24,30,7.57,null,0]
[25,29.76,7.49,null,0]
[26,29.52,7.41,null,0]
[27,29.28,7.32,null,0]
[28,29.04,7.22,null,0]
[29,28.81,7.12,null,0]
[30,28.58,7.01,null,0]
[31,28.35,6.9,null,0]
[32,28.12,6.78,null,0]
[33,27.89,6.66,null,0]
[34,27.66,6.53,null,0]
[35,27.43,6.41,null,0]
[36,27.19,6.28,null,0]
[37,26.95,6.15,null,0]
[38,26.7,6.01,null,0]
[39,26.44,5.89,null,0]
[40,26.18,5.76,null,0]
[41,25.91,5.63,null,0]
[42,25.63,5.5,null,0]
[43,25.34,5.38,null,0]
[44,25.04,5.25,null,0]
[45,24.74,5.12,null,0]
[46,24.43,5,null,0]
[47,24.11,4.88,null,0]
[48,23.78,4.76,null,0]
[49,23.43,4.6399999999999997,null,0]
[50,23.08,4.5199999999999996,null,0]
[51,22.71,4.42,null,0]
[52,22.32,4.3099999999999996,null,0]
[53,21.92,4.21,null,0]
[54,21.5,4.12,null,0]
[55,21.07,4.0199999999999996,null,0]
[56,20.63,3.94,null,0]
[57,20.170000000000002,3.85,null,0]
[58,19.71,3.77,null,0]
[59,19.22,3.7,null,0]
[60,18.73,3.63,null,0]
[61,18.21,3.56,null,0]
[62,17.690000000000001,3.5,null,0]
[63,17.149999999999999,3.44,null,0]
[64,16.61,3.38,null,0]
[65,16.05,3.33]
[66,15.47,3.28]
[67,14.89,3.23]
[68,14.31,3.18]
[69,13.71,2.96,2.2999999999999998]
[70,13.11,2.74,2.12]
[71,12.51,2.7,1.95]
[72,11.91,2.66,1.78]
[73,11.32,2.61,1.63]
[74,10.72,2.4,1.48]
[75,10.14,2.19,1.34]
[76,9.56,2.14,1.21]
[77,9,2.09,1.08]
[78,8.4499999999999993,2.0299999999999998,0.97]
[79,7.92,1.79,0.86]
[80,7.4,1.54,0.76]
[81,6.9,1.49,0.67]
[82,6.43,1.44,0.59]
[83,5.97,1.38,0.52]
[84,5.54,1.1599999999999999,0.45]
[85,5.13,0.95,0.39]
[86,4.74,0.91,0.34]
[87,4.37,0.86,0.28999999999999998]
[88,4.03,0.82,0.25]
[89,3.71,0.64,0.21]
[90,3.41,0.48,0.18]
[91,3.13,0.45,0.15]
[92,2.88,0.42,0.13]
[93,2.65,0.39,0.11]
[94,2.44,0.37,0.09]
[95,2.25,0.34,0.08]

{"sheet":"x-305","index":34,"n_rows":74,"n_cols":3,"rows_kept":74,"cut":false,"hidden":false,"merged":[]}
["Government Actuary's Department"]
[{"$f":"IF(TITLE=\"> Enter workbook title here\",\"Enter workbook title in Cover sheet\",TITLE)","v":"Local Government Pension Scheme (LGPS) - Consolidated Factor Spreadsheet"}]
["Pension Credit - x-305"]
[]
[]
["Data Item","Factor Table Information"]
["Scheme","LGPS_EW"]
["Section","pre 2014"]
["Factor Type","Pension Credit"]
["Description","Pension credit to former spouse or civil partner (pre 2014) - Factors applicable to former spouse or civil partner below age 65"]
["Gender","Male"]
["Factor Age/Period Definition","Age last birthday at relevant date"]
["Section Number",0]
["Series Number",305]
["Table Reference","0-305"]
["Table Reference in Guidance","Table 6.1"]
["Related Factor Guidance Note","LGPS EW Application of pension credit to the former spouse or civil partner of a pre-2014 leaver 5 May 2021"]
["Date Factors Issued to Client","2023-05-25"]
["Date Factors Implemented (if known)","2023-06-01"]
["Factor Status","Issued"]
[]
[null,{"$f":"HYPERLINK(\"#'Factor List'!A1\",\"Back to Factor List\")","v":"Back to Factor List"}]
[]
[]
["Age","Gross Pension of £1 per annum","Lump Sum of £1"]
[16,8.9700000000000006,0.44]
[17,9.1,0.45]
[18,9.23,0.46]
[19,9.36,0.46]
[20,9.49,0.47]
[21,9.6300000000000008,0.48]
[22,9.77,0.49]
[23,9.91,0.5]
[24,10.050000000000001,0.51]
[25,10.19,0.51]
[26,10.34,0.52]
[27,10.49,0.53]
[28,10.64,0.54]
[29,10.79,0.55000000000000004]
[30,10.95,0.56000000000000005]
[31,11.11,0.56999999999999995]
[32,11.27,0.57999999999999996]
[33,11.43,0.59]
[34,11.6,0.6]
[35,11.77,0.61]
[36,11.94,0.62]
[37,12.11,0.63]
[38,12.29,0.64]
[39,12.47,0.65]
[40,12.66,0.66]
[41,12.84,0.67]
[42,13.03,0.68]
[43,13.23,0.7]
[44,13.43,0.71]
[45,13.63,0.72]
[46,13.84,0.73]
[47,14.05,0.74]
[48,14.27,0.76]
[49,14.49,0.77]
[50,14.71,0.78]
[51,14.94,0.8]
[52,15.18,0.81]
[53,15.42,0.82]
[54,15.67,0.84]
[55,15.93,0.85]
[56,16.190000000000001,0.87]
[57,16.46,0.88]
[58,16.75,0.9]
[59,17.04,0.91]
[60,17.34,0.93]
[61,17.649999999999999,0.94]
[62,17.98,0.96]
[63,18.32,0.98]
[64,18.690000000000001,0.99]

{"sheet":"x-306","index":35,"n_rows":74,"n_cols":3,"rows_kept":74,"cut":false,"hidden":false,"merged":[]}
["Government Actuary's Department"]
[{"$f":"IF(TITLE=\"> Enter workbook title here\",\"Enter workbook title in Cover sheet\",TITLE)","v":"Local Government Pension Scheme (LGPS) - Consolidated Factor Spreadsheet"}]
[{"$f":"TABLE_FACTOR_TYPE&\" - x-\"&TABLE_SERIES_NUMBER","v":"Pension Credit - x-306"}]
[]
[]
["Data Item","Factor Table Information"]
["Scheme","LGPS_EW"]
["Section","pre 2014"]
["Factor Type","Pension Credit"]
["Description","Pension credit to former spouse or civil partner (pre 2014) - Factors applicable to former spouse or civil partner below age 65"]
["Gender","Female"]
["Factor Age/Period Definition","Age last birthday at relevant date"]
["Section Number",0]
["Series Number",306]
["Table Reference","0-306"]
["Table Reference in Guidance","Table 6.2"]
["Related Factor Guidance Note","LGPS EW Application of pension credit to the former spouse or civil partner of a pre-2014 leaver 5 May 2021"]
["Date Factors Issued to Client","2023-05-25"]
["Date Factors Implemented (if known)","2023-06-01"]
["Factor Status","Issued"]
[]
[null,{"$f":"HYPERLINK(\"#'Factor List'!A1\",\"Back to Factor List\")","v":"Back to Factor List"}]
[]
[]
["Age","Gross Pension of £1 per annum","Lump Sum of £1"]
[16,8.9700000000000006,0.44]
[17,9.1,0.45]
[18,9.23,0.46]
[19,9.36,0.46]
[20,9.49,0.47]
[21,9.6300000000000008,0.48]
[22,9.77,0.49]
[23,9.91,0.5]
[24,10.050000000000001,0.51]
[25,10.19,0.51]
[26,10.34,0.52]
[27,10.49,0.53]
[28,10.64,0.54]
[29,10.79,0.55000000000000004]
[30,10.95,0.56000000000000005]
[31,11.11,0.56999999999999995]
[32,11.27,0.57999999999999996]
[33,11.43,0.59]
[34,11.6,0.6]
[35,11.77,0.61]
[36,11.94,0.62]
[37,12.11,0.63]
[38,12.29,0.64]
[39,12.47,0.65]
[40,12.66,0.66]
[41,12.84,0.67]
[42,13.03,0.68]
[43,13.23,0.7]
[44,13.43,0.71]
[45,13.63,0.72]
[46,13.84,0.73]
[47,14.05,0.74]
[48,14.27,0.76]
[49,14.49,0.77]
[50,14.71,0.78]
[51,14.94,0.8]
[52,15.18,0.81]
[53,15.42,0.82]
[54,15.67,0.84]
[55,15.93,0.85]
[56,16.190000000000001,0.87]
[57,16.46,0.88]
[58,16.75,0.9]
[59,17.04,0.91]
[60,17.34,0.93]
[61,17.649999999999999,0.94]
[62,17.98,0.96]
[63,18.32,0.98]
[64,18.690000000000001,0.99]

{"sheet":"x-307","index":36,"n_rows":56,"n_cols":2,"rows_kept":56,"cut":false,"hidden":false,"merged":[]}
["Government Actuary's Department"]
[{"$f":"IF(TITLE=\"> Enter workbook title here\",\"Enter workbook title in Cover sheet\",TITLE)","v":"Local Government Pension Scheme (LGPS) - Consolidated Factor Spreadsheet"}]
[{"$f":"TABLE_FACTOR_TYPE&\" - x-\"&TABLE_SERIES_NUMBER","v":"Pension Credit - x-307"}]
[]
[]
["Data Item","Factor Table Information"]
["Scheme","LGPS_EW"]
["Section","pre 2014"]
["Factor Type","Pension Credit"]
["Description","Pension credit to former spouse or civil partner (pre 2014) - Factors applicable to former spouse or civil partner age 65 or above"]
["Gender","Male"]
["Factor Age/Period Definition","Age last birthday at relevant date"]
["Section Number",0]
["Series Number",307]
["Table Reference","0-307"]
["Table Reference in Guidance","Table 7.1"]
["Related Factor Guidance Note","LGPS EW Application of pension credit to the former spouse or civil partner of a pre-2014 leaver 5 May 2021"]
["Date Factors Issued to Client","2023-05-25"]
["Date Factors Implemented (if known)","2023-06-01"]
["Factor Status","Issued"]
[]
[null,{"$f":"HYPERLINK(\"#'Factor List'!A1\",\"Back to Factor List\")","v":"Back to Factor List"}]
[]
[]
["Age","Member's Pension of £1 per annum"]
[65,18.53]
[66,17.86]
[67,17.18]
[68,16.5]
[69,15.81]
[70,15.13]
[71,14.46]
[72,13.79]
[73,13.13]
[74,12.49]
[75,11.86]
[76,11.25]
[77,10.64]
[78,10.039999999999999]
[79,9.4499999999999993]
[80,8.8800000000000008]
[81,8.32]
[82,7.78]
[83,7.27]
[84,6.77]
[85,6.29]
[86,5.83]
[87,5.4]
[88,4.99]
[89,4.6100000000000003]
[90,4.25]
[91,3.92]
[92,3.62]
[93,3.35]
[94,3.1]
[95,2.88]

{"sheet":"x-308","index":37,"n_rows":56,"n_cols":2,"rows_kept":56,"cut":false,"hidden":false,"merged":[]}
["Government Actuary's Department"]
[{"$f":"IF(TITLE=\"> Enter workbook title here\",\"Enter workbook title in Cover sheet\",TITLE)","v":"Local Government Pension Scheme (LGPS) - Consolidated Factor Spreadsheet"}]
[{"$f":"TABLE_FACTOR_TYPE&\" - x-\"&TABLE_SERIES_NUMBER","v":"Pension Credit - x-308"}]
[]
[]
["Data Item","Factor Table Information"]
["Scheme","LGPS_EW"]
["Section","pre 2014"]
["Factor Type","Pension Credit"]
["Description","Pension credit to former spouse or civil partner (pre 2014) - Factors applicable to former spouse or civil partner age 65 or above"]
["Gender","Female"]
["Factor Age/Period Definition","Age last birthday at relevant date"]
["Section Number",0]
["Series Number",308]
["Table Reference","0-308"]
["Table Reference in Guidance","Table 7.2"]
["Related Factor Guidance Note","LGPS EW Application of pension credit to the former spouse or civil partner of a pre-2014 leaver 5 May 2021"]
["Date Factors Issued to Client","2023-05-25"]
["Date Factors Implemented (if known)","2023-06-01"]
["Factor Status","Issued"]
[]
[null,{"$f":"HYPERLINK(\"#'Factor List'!A1\",\"Back to Factor List\")","v":"Back to Factor List"}]
[]
[]
["Age","Member's Pension of £1 per annum"]
[65,18.53]
[66,17.86]
[67,17.18]
[68,16.5]
[69,15.81]
[70,15.13]
[71,14.46]
[72,13.79]
[73,13.13]
[74,12.49]
[75,11.86]
[76,11.25]
[77,10.64]
[78,10.039999999999999]
[79,9.4499999999999993]
[80,8.8800000000000008]
[81,8.32]
[82,7.78]
[83,7.27]
[84,6.77]
[85,6.29]
[86,5.83]
[87,5.4]
[88,4.99]
[89,4.6100000000000003]
[90,4.25]
[91,3.92]
[92,3.62]
[93,3.35]
[94,3.1]
[95,2.88]

{"sheet":"x-309","index":38,"n_rows":105,"n_cols":5,"rows_kept":105,"cut":false,"hidden":false,"merged":[]}
["Government Actuary's Department"]
["LGPS_EW - Consolidated Factor Spreadsheet"]
[{"$f":"TABLE_FACTOR_TYPE&\" - x-\"&TABLE_SERIES_NUMBER","v":"Pension Credit - x-309"}]
[]
[]
["Data Item","Factor Table Information"]
["Scheme","LGPS_EW"]
["Section","post 2014"]
["Factor Type","Pension Credit"]
["Description","Pension credit factors applicable to former spouse or civil partner (post 2014)"]
["Gender","Unisex"]
["Factor Age/Period Definition","Age last birthday at relevant date"]
["Section Number",0]
["Series Number",309]
["Table Reference","0-309"]
["Table Reference in Guidance","Table 4.1"]
["Related Factor Guidance Note","LGPS EW Application of pension credit to the former spouse or civil partner of a post-2014 member 1 April 2019"]
["Date Factors Issued to Client","2023-05-25"]
["Date Factors Implemented (if known)","2023-06-01"]
["Factor Status","Issued"]
[]
[null,{"$f":"HYPERLINK(\"#'Factor List'!A1\",\"Back to Factor List\")","v":"Back to Factor List"}]
[]
[]
["Age","Normal Pension Age of 65","Normal Pension Age of 66","Normal Pension Age of 67","Normal Pension Age of 68"]
[16,8.9700000000000006,8.56,8.16,7.77]
[17,9.1,8.68,8.27,7.87]
[18,9.23,8.8000000000000007,8.39,7.98]
[19,9.36,8.93,8.51,8.1]
[20,9.49,9.06,8.6300000000000008,8.2100000000000009]
[21,9.6300000000000008,9.18,8.75,8.32]
[22,9.77,9.32,8.8699999999999992,8.44]
[23,9.91,9.4499999999999993,9,8.56]
[24,10.050000000000001,9.58,9.1300000000000008,8.68]
[25,10.19,9.7200000000000006,9.26,8.8000000000000007]
[26,10.34,9.86,9.39,8.93]
[27,10.49,10,9.52,9.0500000000000007]
[28,10.64,10.14,9.65,9.18]
[29,10.79,10.29,9.7899999999999991,9.31]
[30,10.95,10.43,9.93,9.44]
[31,11.11,10.58,10.07,9.57]
[32,11.27,10.74,10.220000000000001,9.7100000000000009]
[33,11.43,10.89,10.36,9.84]
[34,11.6,11.05,10.51,9.98]
[35,11.77,11.21,10.66,10.130000000000001]
[36,11.94,11.37,10.81,10.27]
[37,12.11,11.53,10.97,10.42]
[38,12.29,11.7,11.13,10.57]
[39,12.47,11.87,11.29,10.72]
[40,12.66,12.05,11.45,10.87]
[41,12.84,12.22,11.62,11.03]
[42,13.03,12.4,11.79,11.19]
[43,13.23,12.59,11.96,11.35]
[44,13.43,12.78,12.14,11.52]
[45,13.63,12.97,12.32,11.69]
[46,13.84,13.16,12.5,11.86]
[47,14.05,13.36,12.69,12.04]
[48,14.27,13.57,12.88,12.22]
[49,14.49,13.77,13.08,12.4]
[50,14.71,13.99,13.28,12.59]
[51,14.94,14.21,13.49,12.78]
[52,15.18,14.43,13.7,12.98]
[53,15.42,14.66,13.91,13.19]
[54,15.67,14.89,14.13,13.39]
[55,15.93,15.13,14.36,13.61]
[56,16.190000000000001,15.38,14.59,13.83]
[57,16.46,15.64,14.84,14.05]
[58,16.75,15.9,15.08,14.29]
[59,17.04,16.18,15.34,14.53]
[60,17.34,16.46,15.61,14.78]
[61,17.649999999999999,16.760000000000002,15.89,15.04]
[62,17.98,17.07,16.18,15.32]
[63,18.32,17.39,16.489999999999998,15.6]
[64,18.690000000000001,17.73,16.809999999999999,15.91]
[65,18.53,18.100000000000001,17.149999999999999,16.23]
[66,17.86,17.940000000000001,17.510000000000002,16.559999999999999]
[67,17.18,17.260000000000002,17.350000000000001,16.920000000000002]
[68,16.5,16.57,16.66,16.760000000000002]
[69,15.81,15.88,15.96,16.059999999999999]
[70,15.13,15.19,15.27,15.36]
[71,14.46,14.51,14.58,14.67]
[72,13.79,13.83,13.89,13.97]
[73,13.13,13.16,13.21,13.28]
[74,12.49,12.51,12.54,12.6]
[75,11.86,11.87,11.89,11.93]
[76,11.25,11.25,11.25,11.27]
[77,10.64,10.64,10.64,10.64]
[78,10.039999999999999,10.039999999999999,10.039999999999999,10.039999999999999]
[79,9.4499999999999993,9.4499999999999993,9.4499999999999993,9.4499999999999993]
[80,8.8800000000000008,8.8800000000000008,8.8800000000000008,8.8800000000000008]
[81,8.32,8.32,8.32,8.32]
[82,7.78,7.78,7.78,7.78]
[83,7.27,7.27,7.27,7.27]
[84,6.77,6.77,6.77,6.77]
[85,6.29,6.29,6.29,6.29]
[86,5.83,5.83,5.83,5.83]
[87,5.4,5.4,5.4,5.4]
[88,4.99,4.99,4.99,4.99]
[89,4.6100000000000003,4.6100000000000003,4.6100000000000003,4.6100000000000003]
[90,4.25,4.25,4.25,4.25]
[91,3.92,3.92,3.92,3.92]
[92,3.62,3.62,3.62,3.62]
[93,3.35,3.35,3.35,3.35]
[94,3.1,3.1,3.1,3.1]
[95,2.88,2.88,2.88,2.88]

{"sheet":"x-314","index":39,"n_rows":71,"n_cols":4,"rows_kept":71,"cut":false,"hidden":false,"merged":[]}
["Government Actuary's Department"]
["LGPS_EW - Consolidated Factor Spreadsheet"]
["Pension Debit - x-314"]
[]
[]
["Data Item","Factor Table Information"]
["Scheme","LGPS_EW"]
["Section","pre 2014"]
["Factor Type","Pension Debit"]
["Description","Application of pension debit for divorced members (pre 1/4/14) - Reduction to pension and retirement grant debits on ill health retirement"]
["Gender","Male & Female"]
["Factor Age/Period Definition","Years Early"]
["Section Number",0]
["Series Number",314]
["Table Reference","0-314"]
["Table Reference in Guidance","Table A"]
["Related Factor Guidance Note","LGPS EW Application of a pension debit for divorced members (transfer date before 1 April 2014). 11 June 2020"]
["Date Factors Issued to Client","2023-05-25"]
["Date Factors Implemented (if known)","2023-06-01"]
["Factor Status","Issued"]
[]
[null,{"$f":"HYPERLINK(\"#'Factor List'!A1\",\"Back to Factor List\")","v":"Back to Factor List"}]
[]
[]
["Years Early","Pension Reduction (%) - Males","Pension Reduction (%) - Females","Retirement Grant Reduction \nAll Members %"]
[0,0,0,0]
[1,5.6,5.6,1.7]
[2,10.8,10.8,3.3]
[3,15.5,15.5,4.9000000000000004]
[4,19.899999999999999,19.899999999999999,6.5]
[5,23.9,23.9,8.1]
[6,27.7,27.7,9.6]
[7,31.1,31.1,11.1]
[8,34.299999999999997,34.299999999999997,12.6]
[9,37.299999999999997,37.299999999999997,14.1]
[10,40.200000000000003,40.200000000000003,15.5]
[11,42.8,42.8,16.899999999999999]
[12,45.2,45.2,18.3]
[13,47.5,47.5,19.7]
[14,49.7,49.7,21]
[15,51.7,51.7,22.3]
[16,53.6,53.6,23.6]
[17,55.4,55.4,24.9]
[18,57.2,57.2,26.2]
[19,58.8,58.8,27.4]
[20,60.3,60.3,28.6]
[21,61.8,61.8,29.8]
[22,63.1,63.1,31]
[23,64.400000000000006,64.400000000000006,32.1]
[24,65.7,65.7,33.299999999999997]
[25,66.8,66.8,34.4]
[26,68,68,35.5]
[27,69,69,36.6]
[28,70.099999999999994,70.099999999999994,37.6]
[29,71,71,38.700000000000003]
[30,72,72,39.700000000000003]
[31,72.900000000000006,72.900000000000006,40.700000000000003]
[32,73.7,73.7,41.7]
[33,74.5,74.5,42.7]
[34,75.3,75.3,43.6]
[35,76.099999999999994,76.099999999999994,44.6]
[36,76.8,76.8,45.5]
[37,77.5,77.5,46.4]
[38,78.099999999999994,78.099999999999994,47.3]
[39,78.8,78.8,48.2]
[40,79.400000000000006,79.400000000000006,49]
[41,79.900000000000006,79.900000000000006,49.9]
[42,80.5,80.5,50.7]
[43,81,81,51.6]
[44,81.5,81.5,52.4]
[45,82,82,53.2]

{"sheet":"x-315","index":40,"n_rows":36,"n_cols":4,"rows_kept":36,"cut":false,"hidden":false,"merged":[]}
["Government Actuary's Department"]
["LGPS_EW - Consolidated Factor Spreadsheet"]
["Pension Debit - x-315"]
[]
[]
["Data Item","Factor Table Information"]
["Scheme","LGPS_EW"]
["Section","All"]
["Factor Type","Pension Debit"]
["Description","Application of pension debit for divorced members (pre 1/4/14) - Reduction to pension and retirement grant debits on normal health early retirement)"]
["Gender","Male & Female"]
["Factor Age/Period Definition","Years Early"]
["Section Number",0]
["Series Number",315]
["Table Reference","0-315"]
["Table Reference in Guidance","Table B"]
["Related Factor Guidance Note","LGPS EW Application of a pension debit for divorced members (transfer date before 1 April 2014). 11 June 2020"]
["Date Factors Issued to Client","2023-06-30"]
["Date Factors Implemented (if known)","2023-07-03"]
["Factor Status","Issued"]
[]
[null,{"$f":"HYPERLINK(\"#'Factor List'!A1\",\"Back to Factor List\")","v":"Back to Factor List"}]
[]
[]
["Years Early","Pension Reduction (%) - Males","Pension Reduction (%) - Females","Retirement Grant Reduction \nAll Members %"]
[0,0,0,0]
[1,4.9000000000000004,4.9000000000000004,1.7]
[2,9.3000000000000007,9.3000000000000007,3.3]
[3,13.5,13.5,4.9000000000000004]
[4,17.399999999999999,17.399999999999999,6.5]
[5,20.9,20.9,8.1]
[6,24.3,24.3,9.6]
[7,27.4,27.4,11.1]
[8,30.3,30.3,12.6]
[9,33,33,14.1]
[10,35.6,35.6,15.5]

{"sheet":"x-316","index":41,"n_rows":75,"n_cols":4,"rows_kept":75,"cut":false,"hidden":false,"merged":[]}
["Government Actuary's Department"]
["LGPS_EW - Consolidated Factor Spreadsheet"]
["Pension Debit - x-316"]
[]
[]
["Data Item","Factor Table Information"]
["Scheme","LGPS_EW"]
["Section","post 2014"]
["Factor Type","Pension Debit"]
["Description","Application of a pension debit for divorced members (post-14) - Reduction to pension and retirement grant debits on ill-health retirement"]
["Gender","Male & Female"]
["Factor Age/Period Definition","Years Early"]
["Section Number",0]
["Series Number",316]
["Table Reference","0-316"]
["Table Reference in Guidance","Table A"]
["Related Factor Guidance Note","LGPS EW Application of a pension debit for divorced members (transfer date from 1 April 2014). 11 June 2020"]
["Date Factors Issued to Client","2023-05-25"]
["Date Factors Implemented (if known)","2023-06-01"]
["Factor Status","Issued"]
[]
[null,{"$f":"HYPERLINK(\"#'Factor List'!A1\",\"Back to Factor List\")","v":"Back to Factor List"}]
[]
[]
["Years Early","Pension Reduction (%) - Males","Pension Reduction (%) - Females","Retirement Grant Reduction \nAll Members %"]
[0,0,0,0]
[1,5.6,5.6,1.7]
[2,10.8,10.8,3.3]
[3,15.5,15.5,4.9000000000000004]
[4,19.899999999999999,19.899999999999999,6.5]
[5,23.9,23.9,8.1]
[6,27.7,27.7,9.6]
[7,31.1,31.1,11.1]
[8,34.299999999999997,34.299999999999997,12.6]
[9,37.299999999999997,37.299999999999997,14.1]
[10,40.200000000000003,40.200000000000003,15.5]
[11,42.8,42.8,16.899999999999999]
[12,45.2,45.2,18.3]
[13,47.5,47.5,19.7]
[14,49.7,49.7,21]
[15,51.7,51.7,22.3]
[16,53.6,53.6,23.6]
[17,55.4,55.4,24.9]
[18,57.2,57.2,26.2]
[19,58.8,58.8,27.4]
[20,60.3,60.3,28.6]
[21,61.8,61.8,29.8]
[22,63.1,63.1,31]
[23,64.400000000000006,64.400000000000006,32.1]
[24,65.7,65.7,33.299999999999997]
[25,66.8,66.8,34.4]
[26,68,68,35.5]
[27,69,69,36.6]
[28,70.099999999999994,70.099999999999994,37.6]
[29,71,71,38.700000000000003]
[30,72,72,39.700000000000003]
[31,72.900000000000006,72.900000000000006,40.700000000000003]
[32,73.7,73.7,41.7]
[33,74.5,74.5,42.7]
[34,75.3,75.3,43.6]
[35,76.099999999999994,76.099999999999994,44.6]
[36,76.8,76.8,45.5]
[37,77.5,77.5,46.4]
[38,78.099999999999994,78.099999999999994,47.3]
[39,78.8,78.8,48.2]
[40,79.400000000000006,79.400000000000006,49]
[41,79.900000000000006,79.900000000000006,49.9]
[42,80.5,80.5,50.7]
[43,81,81,51.6]
[44,81.5,81.5,52.4]
[45,82,82,53.2]
[46,82.5,82.5,53.9]
[47,83,83,54.7]
[48,83.4,83.4,55.5]
[49,83.8,83.8,56.2]

{"sheet":"x-317","index":42,"n_rows":39,"n_cols":4,"rows_kept":39,"cut":false,"hidden":false,"merged":[]}
["Government Actuary's Department"]
["LGPS_EW - Consolidated Factor Spreadsheet"]
["Pension Debit - x-317"]
[]
[]
["Data Item","Factor Table Information"]
["Scheme","LGPS_EW"]
["Section","All"]
["Factor Type","Pension Debit"]
["Description","Application of a pension debit for divorced members (post-14) - Reduction to pension and retirement grant debits on normal health early retirement"]
["Gender","Male & Female"]
["Factor Age/Period Definition","Years Early"]
["Section Number",0]
["Series Number",317]
["Table Reference","0-317"]
["Table Reference in Guidance","Table B"]
["Related Factor Guidance Note","LGPS EW Application of a pension debit for divorced members (transfer date from 1 April 2014). 11 June 2020"]
["Date Factors Issued to Client","2023-06-30"]
["Date Factors Implemented (if known)","2023-07-03"]
["Factor Status","Issued"]
[]
[null,{"$f":"HYPERLINK(\"#'Factor List'!A1\",\"Back to Factor List\")","v":"Back to Factor List"}]
[]
[]
["Years Early","Pension Reduction (%) - Males","Pension Reduction (%) - Females","Retirement Grant Reduction \nAll Members %"]
[0,0,0,0]
[1,4.9000000000000004,4.9000000000000004,1.7]
[2,9.3000000000000007,9.3000000000000007,3.3]
[3,13.5,13.5,4.9000000000000004]
[4,17.399999999999999,17.399999999999999,6.5]
[5,20.9,20.9,8.1]
[6,24.3,24.3,9.6]
[7,27.4,27.4,11.1]
[8,30.3,30.3,12.6]
[9,33,33,14.1]
[10,35.6,35.6,15.5]
[11,39.5,39.5]
[12,41.8,41.8]
[13,43.9,43.9]

{"sheet":"x-401","index":43,"n_rows":39,"n_cols":4,"rows_kept":39,"cut":false,"hidden":false,"merged":[]}
["Government Actuary's Department"]
[{"$f":"IF(TITLE=\"> Enter workbook title here\",\"Enter workbook title in Cover sheet\",TITLE)","v":"Local Government Pension Scheme (LGPS) - Consolidated Factor Spreadsheet"}]
[{"$f":"TABLE_FACTOR_TYPE&\" - x-\"&TABLE_SERIES_NUMBER","v":"ERF - x-401"}]
[]
[]
["Data Item","Factor Table Information"]
["Scheme","LGPS_EW"]
["Section","All"]
["Factor Type","ERF"]
["Description","Factors to use after age 55"]
["Gender","Male & Female"]
["Factor Age/Period Definition","Years Early"]
["Section Number",0]
["Series Number",401]
["Table Reference","0-401"]
["Table Reference in Guidance","Appendix A: Table 1"]
["Related Factor Guidance Note","LGPS EW Early retirement guidance 5 May 2021"]
["Date Factors Issued to Client","2023-06-30"]
["Date Factors Implemented (if known)","2023-07-03"]
["Factor Status","Issued"]
[]
[null,{"$f":"HYPERLINK(\"#'Factor List'!A1\",\"Back to Factor List\")","v":"Back to Factor List"}]
[]
[]
["Years Early","Pension Reduction (%) - Males","Pension Reduction (%) - Females","Retirement Grant Reduction (%) - All Members"]
[0,0,0,0]
[1,4.9000000000000002E-2,4.9000000000000002E-2,1.7000000000000001E-2]
[2,9.2999999999999999E-2,9.2999999999999999E-2,3.3000000000000002E-2]
[3,0.13500000000000001,0.13500000000000001,4.9000000000000002E-2]
[4,0.17399999999999999,0.17399999999999999,6.5000000000000002E-2]
[5,0.20899999999999999,0.20899999999999999,8.1000000000000003E-2]
[6,0.24299999999999999,0.24299999999999999,9.6000000000000002E-2]
[7,0.27400000000000002,0.27400000000000002,0.111]
[8,0.30299999999999999,0.30299999999999999,0.126]
[9,0.33,0.33,0.14099999999999999]
[10,0.35599999999999998,0.35599999999999998,0.155]
[11,0.39500000000000002,0.39500000000000002]
[12,0.41799999999999998,0.41799999999999998]
[13,0.439,0.439]

{"sheet":"x-402","index":44,"n_rows":35,"n_cols":3,"rows_kept":35,"cut":false,"hidden":false,"merged":[]}
["Government Actuary's Department"]
[{"$f":"IF(TITLE=\"> Enter workbook title here\",\"Enter workbook title in Cover sheet\",TITLE)","v":"Local Government Pension Scheme (LGPS) - Consolidated Factor Spreadsheet"}]
[{"$f":"TABLE_FACTOR_TYPE&\" - x-\"&TABLE_SERIES_NUMBER","v":"LRF - x-402"}]
[]
[]
["Data Item","Factor Table Information"]
["Client","LGPS_EW"]
["Section",2014]
["Factor Type","LRF"]
["Description","Late retirement increase for pre and post 31 March 2014 benefits"]
["Gender","Unisex"]
["Factor Age/Period Definition","Years Late"]
["Section Number",0]
["Series Number",402]
["Table Reference","0-402"]
["Table Reference in Guidance","Appendix A"]
["Related Factor Guidance Note","LGPS EW Late retirement guidance 5 May 2021"]
["Date Factors Issued to Client","2023-06-30"]
["Date Factors Implemented (if known)","2023-09-01"]
["Factor Status","Issued"]
[]
[null,{"$f":"HYPERLINK(\"#'Factor List'!A1\",\"Back to Factor List\")","v":"Back to Factor List"}]
[]
[]
["Years Late","Pension Increase (%)","Retirement Grant Increase (%)"]
[1,9.7999999999999997E-5,0]
[2,1.07E-4,0]
[3,1.17E-4,0]
[4,1.2899999999999999E-4,0]
[5,1.4100000000000001E-4,0]
[6,1.56E-4,0]
[7,1.7100000000000001E-4,0]
[8,1.8900000000000001E-4,0]
[9,2.0799999999999999E-4,0]
[10,2.3000000000000001E-4,0]

{"sheet":"x-501","index":45,"n_rows":71,"n_cols":8,"rows_kept":71,"cut":false,"hidden":false,"merged":[]}
["Government Actuary's Department"]
[{"$f":"IF(TITLE=\"> Enter workbook title here\",\"Enter workbook title in Cover sheet\",TITLE)","v":"Local Government Pension Scheme (LGPS) - Consolidated Factor Spreadsheet"}]
[{"$f":"TABLE_FACTOR_TYPE&\" - x-\"&TABLE_SERIES_NUMBER","v":"Triv Comm - x-501"}]
[]
[]
["Data Item","Factor Table Information",null,null,null,"Data Item","Factor Table Information"]
["Scheme","LGPS_EW",null,null,null,"Scheme","LGPS_EW"]
["Section","All",null,null,null,"Section","All"]
["Factor Type","Triv Comm",null,null,null,"Factor Type","Triv Comm"]
["Description","Trivial commutation - Factors for member's pension - Male member",null,null,null,"Description","Trivial commutation - Factors for member's pension - Female member"]
["Gender","Male",null,null,null,"Gender","Female"]
["Factor Age/Period Definition","Member's age last birthday at the date of commutation",null,null,null,"Factor Age/Period Definition","Member's age last birthday at the date of commutation"]
["Section Number",0,null,null,null,"Section Number",0]
["Series Number",501,null,null,null,"Series Number",501]
["Table Reference","0-501A",null,null,null,"Table Reference","0-501B"]
["Table Reference in Guidance","Table A",null,null,null,"Table Reference in Guidance","Table A"]
["Related Factor Guidance Note","LGPS EW Trivial commutation guidance 15 April 2020",null,null,null,"Related Factor Guidance Note","LGPS EW Trivial commutation guidance 15 April 2020"]
["Date Factors Issued to Client","2023-07-27",null,null,null,"Date Factors Issued to Client","2023-07-27"]
["Date Factors Implemented (if known)","2023-07-28",null,null,null,"Date Factors Implemented (if known)","2023-07-28"]
["Factor Status","Issued",null,null,null,"Factor Status","Issued"]
[]
[null,{"$f":"HYPERLINK(\"#'Factor List'!A1\",\"Back to Factor List\")","v":"Back to Factor List"}]
[]
[]
["Age","Factor to apply to member's pension (Fac1)","Factor to apply to dependant's pension (Fac2)",null,null,"Age","Factor to apply to member's pension (Fac1)","Factor to apply to dependant's pension (Fac2)"]
[55,24.92,2.21,null,null,55,24.92,2.21]
[56,24.35,2.23,null,null,56,24.35,2.23]
[57,23.77,2.2400000000000002,null,null,57,23.77,2.2400000000000002]
[58,23.18,2.25,null,null,58,23.18,2.25]
[59,22.6,2.2599999999999998,null,null,59,22.6,2.2599999999999998]
[60,22,2.27,null,null,60,22,2.27]
[61,21.41,2.2799999999999998,null,null,61,21.41,2.2799999999999998]
[62,20.81,2.2799999999999998,null,null,62,20.81,2.2799999999999998]
[63,20.22,2.2799999999999998,null,null,63,20.22,2.2799999999999998]
[64,19.62,2.2799999999999998,null,null,64,19.62,2.2799999999999998]
[65,18.989999999999998,2.27,null,null,65,18.989999999999998,2.27]
[66,18.309999999999999,2.27,null,null,66,18.309999999999999,2.27]
[67,17.64,2.2599999999999998,null,null,67,17.64,2.2599999999999998]
[68,16.96,2.2400000000000002,null,null,68,16.96,2.2400000000000002]
[69,16.28,2.11,null,null,69,16.28,2.11]
[70,15.6,1.98,null,null,70,15.6,1.98]
[71,14.92,1.96,null,null,71,14.92,1.96]
[72,14.25,1.94,null,null,72,14.25,1.94]
[73,13.59,1.92,null,null,73,13.59,1.92]
[74,12.94,1.77,null,null,74,12.94,1.77]
[75,12.3,1.63,null,null,75,12.3,1.63]
[76,11.67,1.6,null,null,76,11.67,1.6]
[77,11.05,1.58,null,null,77,11.05,1.58]
[78,10.44,1.54,null,null,78,10.44,1.54]
[79,9.83,1.37,null,null,79,9.83,1.37]
[80,9.24,1.2,null,null,80,9.24,1.2]
[81,8.67,1.17,null,null,81,8.67,1.17]
[82,8.11,1.1299999999999999,null,null,82,8.11,1.1299999999999999]
[83,7.57,1.1000000000000001,null,null,83,7.57,1.1000000000000001]
[84,7.05,0.94,null,null,84,7.05,0.94]
[85,6.55,0.78,null,null,85,6.55,0.78]
[86,6.07,0.75,null,null,86,6.07,0.75]
[87,5.62,0.71,null,null,87,5.62,0.71]
[88,5.2,0.68,null,null,88,5.2,0.68]
[89,4.8,0.54,null,null,89,4.8,0.54]
[90,4.43,0.41,null,null,90,4.43,0.41]
[91,4.09,0.39,null,null,91,4.09,0.39]
[92,3.77,0.37,null,null,92,3.77,0.37]
[93,3.49,0.34,null,null,93,3.49,0.34]
[94,3.23,0.32,null,null,94,3.23,0.32]
[95,2.99,0.3,null,null,95,2.99,0.3]
[96,2.78,0.28000000000000003,null,null,96,2.78,0.28000000000000003]
[97,2.6,0.26,null,null,97,2.6,0.26]
[98,2.44,0.25,null,null,98,2.44,0.25]
[99,2.31,0.23,null,null,99,2.31,0.23]
[100,2.21,0.22,null,null,100,2.21,0.22]

{"sheet":"x-502","index":46,"n_rows":106,"n_cols":6,"rows_kept":106,"cut":false,"hidden":false,"merged":[]}
["Government Actuary's Department"]
[{"$f":"IF(TITLE=\"> Enter workbook title here\",\"Enter workbook title in Cover sheet\",TITLE)","v":"Local Government Pension Scheme (LGPS) - Consolidated Factor Spreadsheet"}]
[{"$f":"TABLE_FACTOR_TYPE&\" - x-\"&TABLE_SERIES_NUMBER","v":"Triv Comm - x-502"}]
[]
[]
["Data Item","Factor Table Information",null,null,"Data Item","Factor Table Information"]
["Scheme","LGPS_EW",null,null,"Scheme","LGPS_EW"]
["Section","All",null,null,"Section","All"]
["Factor Type","Triv Comm",null,null,"Factor Type","Triv Comm"]
["Description","Trivial commutation - Factors for surviving adult dependant's and pension credit member's pension - Females",null,null,"Description","Trivial commutation - Factors for surviving adult dependant's and pension credit member's pension - Males"]
["Gender","Female",null,null,"Gender","Male"]
["Factor Age/Period Definition","Age last birthday",null,null,"Factor Age/Period Definition","Age last birthday"]
["Section Number",0,null,null,"Section Number",0]
["Series Number",502,null,null,"Series Number",502]
["Table Reference","0-502A",null,null,"Table Reference","0-502B"]
["Table Reference in Guidance","Table B",null,null,"Table Reference in Guidance","Table B"]
["Related Factor Guidance Note","LGPS EW Trivial commutation guidance 15 April 2020",null,null,"Related Factor Guidance Note","LGPS EW Trivial commutation guidance 15 April 2020"]
["Date Factors Issued to Client","2023-07-27",null,null,"Date Factors Issued to Client","2023-07-27"]
["Date Factors Implemented (if known)","2023-07-28",null,null,"Date Factors Implemented (if known)","2023-07-28"]
["Factor Status","Issued",null,null,"Factor Status","Issued"]
[]
[null,{"$f":"HYPERLINK(\"#'Factor List'!A1\",\"Back to Factor List\")","v":"Back to Factor List"}]
[]
[]
["Age","Factor to apply to whole pension (Fac1)",null,null,"Age","Factor to apply to whole pension (Fac1)"]
[20,40.32,null,null,20,40.32]
[21,39.979999999999997,null,null,21,39.979999999999997]
[22,39.630000000000003,null,null,22,39.630000000000003]
[23,39.270000000000003,null,null,23,39.270000000000003]
[24,38.909999999999997,null,null,24,38.909999999999997]
[25,38.54,null,null,25,38.54]
[26,38.17,null,null,26,38.17]
[27,37.79,null,null,27,37.79]
[28,37.4,null,null,28,37.4]
[29,37.01,null,null,29,37.01]
[30,36.61,null,null,30,36.61]
[31,36.200000000000003,null,null,31,36.200000000000003]
[32,35.79,null,null,32,35.79]
[33,35.369999999999997,null,null,33,35.369999999999997]
[34,34.950000000000003,null,null,34,34.950000000000003]
[35,34.520000000000003,null,null,35,34.520000000000003]
[36,34.08,null,null,36,34.08]
[37,33.630000000000003,null,null,37,33.630000000000003]
[38,33.18,null,null,38,33.18]
[39,32.72,null,null,39,32.72]
[40,32.26,null,null,40,32.26]
[41,31.78,null,null,41,31.78]
[42,31.3,null,null,42,31.3]
[43,30.82,null,null,43,30.82]
[44,30.33,null,null,44,30.33]
[45,29.83,null,null,45,29.83]
[46,29.32,null,null,46,29.32]
[47,28.8,null,null,47,28.8]
[48,28.28,null,null,48,28.28]
[49,27.76,null,null,49,27.76]
[50,27.22,null,null,50,27.22]
[51,26.68,null,null,51,26.68]
[52,26.13,null,null,52,26.13]
[53,25.58,null,null,53,25.58]
[54,25.02,null,null,54,25.02]
[55,24.45,null,null,55,24.45]
[56,23.88,null,null,56,23.88]
[57,23.3,null,null,57,23.3]
[58,22.72,null,null,58,22.72]
[59,22.13,null,null,59,22.13]
[60,21.54,null,null,60,21.54]
[61,20.95,null,null,61,20.95]
[62,20.36,null,null,62,20.36]
[63,19.760000000000002,null,null,63,19.760000000000002]
[64,19.170000000000002,null,null,64,19.170000000000002]
[65,18.53,null,null,65,18.53]
[66,17.86,null,null,66,17.86]
[67,17.18,null,null,67,17.18]
[68,16.5,null,null,68,16.5]
[69,15.81,null,null,69,15.81]
[70,15.13,null,null,70,15.13]
[71,14.46,null,null,71,14.46]
[72,13.79,null,null,72,13.79]
[73,13.13,null,null,73,13.13]
[74,12.49,null,null,74,12.49]
[75,11.86,null,null,75,11.86]
[76,11.25,null,null,76,11.25]
[77,10.64,null,null,77,10.64]
[78,10.039999999999999,null,null,78,10.039999999999999]
[79,9.4499999999999993,null,null,79,9.4499999999999993]
[80,8.8800000000000008,null,null,80,8.8800000000000008]
[81,8.32,null,null,81,8.32]
[82,7.78,null,null,82,7.78]
[83,7.27,null,null,83,7.27]
[84,6.77,null,null,84,6.77]
[85,6.29,null,null,85,6.29]
[86,5.83,null,null,86,5.83]
[87,5.4,null,null,87,5.4]
[88,4.99,null,null,88,4.99]
[89,4.6100000000000003,null,null,89,4.6100000000000003]
[90,4.25,null,null,90,4.25]
[91,3.92,null,null,91,3.92]
[92,3.62,null,null,92,3.62]
[93,3.35,null,null,93,3.35]
[94,3.1,null,null,94,3.1]
[95,2.88,null,null,95,2.88]
[96,2.68,null,null,96,2.68]
[97,2.5099999999999998,null,null,97,2.5099999999999998]
[98,2.35,null,null,98,2.35]
[99,2.23,null,null,99,2.23]
[100,2.14,null,null,100,2.14]

{"sheet":"x-503","index":47,"n_rows":41,"n_cols":6,"rows_kept":41,"cut":false,"hidden":false,"merged":[]}
["Government Actuary's Department"]
[{"$f":"IF(TITLE=\"> Enter workbook title here\",\"Enter workbook title in Cover sheet\",TITLE)","v":"Local Government Pension Scheme (LGPS) - Consolidated Factor Spreadsheet"}]
[{"$f":"TABLE_FACTOR_TYPE&\" - x-\"&TABLE_SERIES_NUMBER","v":"Triv Comm - x-503"}]
[]
[]
["Data Item","Factor Table Information",null,null,"Data Item","Factor Table Information"]
["Scheme","LGPS_EW",null,null,"Scheme","LGPS_EW"]
["Section","All",null,null,"Section","All"]
["Factor Type","Triv Comm",null,null,"Factor Type","Triv Comm"]
["Description","Trivial commutation - Factors for children's pension",null,null,"Description","Trivial commutation - Factors for children's pension"]
["Gender","Unisex",null,null,"Gender","Unisex"]
["Factor Age/Period Definition","Age last birthday of child (male and female)",null,null,"Factor Age/Period Definition","Number of years expected to remain in full-time education"]
["Section Number",0,null,null,"Section Number",0]
["Series Number",503,null,null,"Series Number",503]
["Table Reference","0-503A",null,null,"Table Reference","0-503B"]
["Table Reference in Guidance","Table C",null,null,"Table Reference in Guidance","Table C"]
["Related Factor Guidance Note","LGPS EW Trivial commutation guidance 15 April 2020",null,null,"Related Factor Guidance Note","LGPS EW Trivial commutation guidance 15 April 2020"]
["Date Factors Issued to Client","2023-07-27",null,null,"Date Factors Issued to Client","2023-07-27"]
["Date Factors Implemented (if known)","2023-07-28",null,null,"Date Factors Implemented (if known)","2023-07-28"]
["Factor Status","Issued",null,null,"Factor Status","Issued"]
[]
[null,{"$f":"HYPERLINK(\"#'Factor List'!A1\",\"Back to Factor List\")","v":"Back to Factor List"}]
[]
[]
["Age last birthday of child (male and female)","Factor to apply to child's pension (Fac1)",null,null,"Years Early","Factor to apply to child's pension (Fac1)"]
[0,16.62,null,null,7,6.6]
[1,15.89,null,null,6,5.71]
[2,15.15,null,null,5,4.8]
[3,14.4,null,null,4,3.87]
[4,13.64,null,null,3,2.93]
[5,12.86,null,null,2,1.97]
[6,12.07,null,null,1,0.99]
[7,11.27,null,null,0,0]
[8,10.45]
[9,9.6199999999999992]
[10,8.7799999999999994]
[11,7.92]
[12,7.05]
[13,6.16]
[14,5.25]
[15,4.33]

{"sheet":"x-504","index":48,"n_rows":85,"n_cols":4,"rows_kept":85,"cut":false,"hidden":false,"merged":[]}
["Government Actuary's Department"]
[{"$f":"IF(TITLE=\"> Enter workbook title here\",\"Enter workbook title in Cover sheet\",TITLE)","v":"Local Government Pension Scheme (LGPS) - Consolidated Factor Spreadsheet"}]
[{"$f":"TABLE_FACTOR_TYPE&\" - x-\"&TABLE_SERIES_NUMBER","v":"Inverse Comm - x-504"}]
[]
[]
["Data Item","Factor Table Information"]
["Scheme","LGPS_EW"]
["Section","All"]
["Factor Type","Inverse Comm"]
["Description","Inverse Commutation Factors - Amount of additional pension for every £100 of lump sum\nNormal Retirement (ages 55 to 75)"]
["Gender","Male & Female"]
["Factor Age/Period Definition","Age at date member becomes entitled to an immediate pension in years and complete months"]
["Section Number",0]
["Series Number",504]
["Table Reference","0-504A and 0-504B"]
["Table Reference in Guidance","Table A"]
["Related Factor Guidance Note","LGPS EW Inverse commutation reg 58 5 May 2021"]
["Date Factors Issued to Client","2023-07-27"]
["Date Factors Implemented (if known)","2023-07-28"]
["Factor Status","Issued"]
[]
[null,{"$f":"HYPERLINK(\"#'Factor List'!A1\",\"Back to Factor List\")","v":"Back to Factor List"}]
[]
[]
["Age",null,"Pension (£) for a member who is married or in a civil partnership","Pension (£) for a member who is not married or in a civil partnership"]
["from","to"]
["55 years and 0 months ","55 years and 5 months",3.78,3.99]
["55 years and 6 months","55 years and 11 months",3.82,4.04]
[]
["56 years and 0 months","56 years and 5 months",3.86,4.08]
["56 years and 6 months","56 years and 11 months",3.9,4.13]
[]
["57 years and 0 months","57 years and 5 months",3.95,4.18]
["57 years and 6 months","57 years and 11 months",3.99,4.2300000000000004]
[]
["58 years and 0 months","58 years and 5 months",4.04,4.29]
["58 years and 6 months","58 years and 11 months",4.08,4.34]
[]
["59 years and 0 months","59 years and 5 months",4.13,4.4000000000000004]
["59 years and 6 months","59 years and 11 months",4.18,4.46]
[]
["60 years and 0 months","60 years and 5 months",4.24,4.51]
["60 years and 6 months","60 years and 11 months",4.29,4.58]
[]
["61 years and 0 months","61 years and 5 months",4.34,4.6399999999999997]
["61 years and 6 months","61 years and 11 months",4.4000000000000004,4.7]
[]
["62 years and 0 months","62 years and 5 months",4.46,4.7699999999999996]
["62 years and 6 months","62 years and 11 months",4.5199999999999996,4.84]
[]
["63 years and 0 months","63 years and 5 months",4.58,4.91]
["63 years and 6 months","63 years and 11 months",4.6500000000000004,4.9800000000000004]
[]
["64 years and 0 months","64 years and 5 months",4.71,5.0599999999999996]
["64 years and 6 months","64 years and 11 months",4.78,5.14]
[]
["65 years and 0 months","65 years and 5 months",4.8499999999999996,5.22]
["65 years and 6 months","65 years and 11 months",4.93,5.32]
[]
["66 years and 0 months","66 years and 5 months",5.0199999999999996,5.41]
["66 years and 6 months","66 years and 11 months",5.0999999999999996,5.51]
[]
["67 years and 0 months","67 years and 5 months",5.19,5.62]
["67 years and 6 months","67 years and 11 months",5.29,5.73]
[]
["68 years and 0 months","68 years and 5 months",5.39,5.84]
["68 years and 6 months","68 years and 11 months",5.49,5.96]
[]
["69 years and 0 months","69 years and 5 months",5.59,6.08]
["69 years and 6 months","69 years and 11 months",5.71,6.21]
[]
["70 years and 0 months","70 years and 5 months",5.82,6.34]
["70 years and 6 months","70 years and 11 months",5.94,6.48]
[]
["71 years and 0 months","71 years and 5 months",6.06,6.63]
["71 years and 6 months","71 years and 11 months",6.19,6.78]
[]
["72 years and 0 months","72 years and 5 months",6.33,6.94]
["72 years and 6 months","72 years and 11 months",6.47,7.1]
[]
["73 years and 0 months","73 years and 5 months",6.61,7.27]
["73 years and 6 months","73 years and 11 months",6.76,7.45]
[]
["74 years and 0 months","74 years and 5 months",6.92,7.64]
["74 years and 6 months","74 years and 11 months",7.08,7.83]

{"sheet":"x-505","index":49,"n_rows":160,"n_cols":4,"rows_kept":160,"cut":false,"hidden":false,"merged":[]}
["Government Actuary's Department"]
[{"$f":"IF(TITLE=\"> Enter workbook title here\",\"Enter workbook title in Cover sheet\",TITLE)","v":"Local Government Pension Scheme (LGPS) - Consolidated Factor Spreadsheet"}]
[{"$f":"TABLE_FACTOR_TYPE&\" - x-\"&TABLE_SERIES_NUMBER","v":"Inverse Comm - x-505"}]
[]
[]
["Data Item","Factor Table Information"]
["Scheme","LGPS_EW"]
["Section","All"]
["Factor Type","Inverse Comm"]
["Description","Inverse Commutation Factors - Amount of additional pension for every £100 of lump sum \nIll-Health Retirement (ages 30 to 75)"]
["Gender","Male & Female"]
["Factor Age/Period Definition","Age at date member becomes entitled to an immediate pension in years and complete months"]
["Section Number",0]
["Series Number",505]
["Table Reference","0-505A and 0-505B"]
["Table Reference in Guidance","Table B"]
["Related Factor Guidance Note","LGPS EW Inverse commutation reg 58 5 May 2021"]
["Date Factors Issued to Client","2023-07-27"]
["Date Factors Implemented (if known)","2023-07-28"]
["Factor Status","Issued"]
[]
[null,{"$f":"HYPERLINK(\"#'Factor List'!A1\",\"Back to Factor List\")","v":"Back to Factor List"}]
[]
[]
["Age",null,"Pension (£) for a member who is married or in a civil partnership","Pension (£) for a member who is not married or in a civil partnership"]
["from","to"]
["30 years and 0 months","30 years and 5 months",2.96,3.42]
["30 years and 6 months","30 years and 11 months",2.98,3.44]
[]
["31 years and 0 months","31 years and 5 months",2.99,3.45]
["31 years and 6 months","31 years and 11 months",3,3.46]
[]
["32 years and 0 months","32 years and 5 months",3.02,3.48]
["32 years and 6 months","32 years and 11 months",3.03,3.49]
[]
["33 years and 0 months","33 years and 5 months",3.04,3.51]
["33 years and 6 months","33 years and 11 months",3.06,3.52]
[]
["34 years and 0 months","34 years and 5 months",3.07,3.53]
["34 years and 6 months","34 years and 11 months",3.09,3.55]
[]
["35 years and 0 months","35 years and 5 months",3.1,3.56]
["35 years and 6 months","35 years and 11 months",3.12,3.58]
[]
["36 years and 0 months","36 years and 5 months",3.13,3.59]
["36 years and 6 months","36 years and 11 months",3.15,3.61]
[]
["37 years and 0 months","37 years and 5 months",3.17,3.62]
["37 years and 6 months","37 years and 11 months",3.18,3.64]
[]
["38 years and 0 months","38 years and 5 months",3.2,3.66]
["38 years and 6 months","38 years and 11 months",3.22,3.67]
[]
["39 years and 0 months","39 years and 5 months",3.23,3.69]
["39 years and 6 months","39 years and 11 months",3.25,3.71]
[]
["40 years and 0 months","40 years and 5 months",3.27,3.73]
["40 years and 6 months","40 years and 11 months",3.29,3.75]
[]
["41 years and 0 months","41 years and 5 months",3.31,3.76]
["41 years and 6 months","41 years and 11 months",3.33,3.78]
[]
["42 years and 0 months","42 years and 5 months",3.35,3.8]
["42 years and 6 months","42 years and 11 months",3.37,3.82]
[]
["43 years and 0 months","43 years and 5 months",3.39,3.85]
["43 years and 6 months","43 years and 11 months",3.41,3.87]
[]
["44 years and 0 months","44 years and 5 months",3.44,3.89]
["44 years and 6 months","44 years and 11 months",3.46,3.91]
[]
["45 years and 0 months","45 years and 5 months",3.48,3.94]
["45 years and 6 months","45 years and 11 months",3.51,3.96]
[]
["46 years and 0 months","46 years and 5 months",3.53,3.99]
["46 years and 6 months","46 years and 11 months",3.55,4.01]
[]
["47 years and 0 months","47 years and 5 months",3.58,4.04]
["47 years and 6 months","47 years and 11 months",3.61,4.07]
[]
["48 years and 0 months","48 years and 5 months",3.63,4.09]
["48 years and 6 months","48 years and 11 months",3.66,4.12]
[]
["49 years and 0 months","49 years and 5 months",3.69,4.1500000000000004]
["49 years and 6 months","49 years and 11 months",3.72,4.18]
[]
["50 years and 0 months","50 years and 5 months",3.75,4.22]
["50 years and 6 months","50 years and 11 months",3.78,4.25]
[]
["51 years and 0 months","51 years and 5 months",3.82,4.28]
["51 years and 6 months","51 years and 11 months",3.85,4.32]
[]
["52 years and 0 months","52 years and 5 months",3.88,4.3499999999999996]
["52 years and 6 months","52 years and 11 months",3.92,4.3899999999999997]
[]
["53 years and 0 months","53 years and 5 months",3.95,4.43]
["53 years and 6 months","53 years and 11 months",3.99,4.47]
[]
["54 years and 0 months","54 years and 5 months",4.03,4.51]
["54 years and 6 months","54 years and 11 months",4.07,4.5599999999999996]
[]
["55 years and 0 months ","55 years and 5 months",4.1100000000000003,4.5999999999999996]
["55 years and 6 months","55 years and 11 months",4.1500000000000004,4.6500000000000004]
[]
["56 years and 0 months","56 years and 5 months",4.2,4.7]
["56 years and 6 months","56 years and 11 months",4.24,4.75]
[]
["57 years and 0 months","57 years and 5 months",4.29,4.8]
["57 years and 6 months","57 years and 11 months",4.34,4.8499999999999996]
[]
["58 years and 0 months","58 years and 5 months",4.38,4.91]
["58 years and 6 months","58 years and 11 months",4.4400000000000004,4.97]
[]
["59 years and 0 months","59 years and 5 months",4.49,5.03]
["59 years and 6 months","59 years and 11 months",4.54,5.09]
[]
["60 years and 0 months","60 years and 5 months",4.5999999999999996,5.15]
["60 years and 6 months","60 years and 11 months",4.66,5.22]
[]
["61 years and 0 months","61 years and 5 months",4.71,5.29]
["61 years and 6 months","61 years and 11 months",4.78,5.36]
[]
["62 years and 0 months","62 years and 5 months",4.84,5.43]
["62 years and 6 months","62 years and 11 months",4.91,5.51]
[]
["63 years and 0 months","63 years and 5 months",4.97,5.59]
["63 years and 6 months","63 years and 11 months",5.04,5.67]
[]
["64 years and 0 months","64 years and 5 months",5.12,5.76]
["64 years and 6 months","64 years and 11 months",5.19,5.85]
[]
["65 years and 0 months","65 years and 5 months",5.28,5.95]
["65 years and 6 months","65 years and 11 months",5.37,6.07]
[]
["66 years and 0 months","66 years and 5 months",5.48,6.2]
["66 years and 6 months","66 years and 11 months",5.58,6.33]
[]
["67 years and 0 months","67 years and 5 months",5.7,6.46]
["67 years and 6 months","67 years and 11 months",5.81,6.61]
[]
["68 years and 0 months","68 years and 5 months",5.93,6.76]
["68 years and 6 months","68 years and 11 months",6.06,6.91]
[]
["69 years and 0 months","69 years and 5 months",6.19,7.08]
["69 years and 6 months","69 years and 11 months",6.33,7.25]
[]
["70 years and 0 months","70 years and 5 months",6.47,7.43]
["70 years and 6 months","70 years and 11 months",6.62,7.62]
[]
["71 years and 0 months","71 years and 5 months",6.78,7.82]
["71 years and 6 months","71 years and 11 months",6.94,8.0299999999999994]
[]
["72 years and 0 months","72 years and 5 months",7.11,8.24]
["72 years and 6 months","72 years and 11 months",7.28,8.4700000000000006]
[]
["73 years and 0 months","73 years and 5 months",7.47,8.6999999999999993]
["73 years and 6 months","73 years and 11 months",7.65,8.94]
[]
["74 years and 0 months","74 years and 5 months",7.85,9.1999999999999993]
["74 years and 6 months","74 years and 11 months",8.0500000000000007,9.4600000000000009]

{"sheet":"x-603","index":50,"n_rows":78,"n_cols":5,"rows_kept":78,"cut":false,"hidden":false,"merged":[]}
["Government Actuary's Department"]
[{"$f":"IF(TITLE=\"> Enter workbook title here\",\"Enter workbook title in Cover sheet\",TITLE)","v":"Local Government Pension Scheme (LGPS) - Consolidated Factor Spreadsheet"}]
[{"$f":"TABLE_FACTOR_TYPE&\" - x-\"&TABLE_SERIES_NUMBER","v":"Scheme pays AA - x-603"}]
[]
[]
["Data Item","Factor Table Information"]
["Scheme","LGPS_EW"]
["Section","Post-14"]
["Factor Type","Scheme pays AA"]
["Description","Scheme pays factors for males and females"]
["Gender","Unisex"]
["Factor Age/Period Definition","Age last birthday at relevant date"]
["Section Number",0]
["Series Number",603]
["Table Reference","0-603"]
["Table Reference in Guidance","Table A1"]
["Related Factor Guidance Note","LGPS EW Annual Allowance charges: Calculation of scheme pays 5 May 2021"]
["Date Factors Issued to Client","2023-07-27"]
["Date Factors Implemented (if known)","2023-07-28"]
["Factor Status","Issued"]
[]
[null,{"$f":"HYPERLINK(\"#'Factor List'!A1\",\"Back to Factor List\")","v":"Back to Factor List"}]
[]
[]
["Age","Normal pension age of 65","Normal pension age of 66","Normal pension age of 67","Normal pension age of 68"]
[16,9.2100000000000009,8.8000000000000007,8.39,8]
[17,9.35,8.93,8.51,8.11]
[18,9.48,9.0500000000000007,8.6300000000000008,8.23]
[19,9.6199999999999992,9.18,8.76,8.34]
[20,9.76,9.32,8.8800000000000008,8.4600000000000009]
[21,9.9,9.4499999999999993,9.01,8.58]
[22,10.050000000000001,9.59,9.14,8.6999999999999993]
[23,10.19,9.73,9.27,8.83]
[24,10.34,9.8699999999999992,9.4,8.9499999999999993]
[25,10.49,10.01,9.5399999999999991,9.08]
[26,10.64,10.15,9.68,9.2100000000000009]
[27,10.8,10.3,9.81,9.34]
[28,10.95,10.45,9.9600000000000009,9.4700000000000006]
[29,11.11,10.6,10.1,9.61]
[30,11.27,10.75,10.24,9.74]
[31,11.44,10.91,10.39,9.8800000000000008]
[32,11.61,11.07,10.54,10.02]
[33,11.78,11.23,10.69,10.17]
[34,11.95,11.39,10.84,10.31]
[35,12.12,11.56,11,10.46]
[36,12.3,11.72,11.16,10.61]
[37,12.48,11.89,11.32,10.76]
[38,12.66,12.07,11.49,10.92]
[39,12.85,12.24,11.65,11.07]
[40,13.04,12.42,11.82,11.23]
[41,13.23,12.61,11.99,11.4]
[42,13.43,12.79,12.17,11.56]
[43,13.63,12.98,12.35,11.73]
[44,13.83,13.17,12.53,11.9]
[45,14.04,13.37,12.71,12.07]
[46,14.25,13.57,12.9,12.25]
[47,14.47,13.77,13.1,12.43]
[48,14.69,13.98,13.29,12.62]
[49,14.91,14.19,13.49,12.81]
[50,15.14,14.41,13.7,13]
[51,15.38,14.63,13.91,13.2]
[52,15.62,14.86,14.12,13.4]
[53,15.86,15.09,14.34,13.6]
[54,16.12,15.33,14.56,13.81]
[55,16.37,15.57,14.79,14.03]
[56,16.64,15.82,15.03,14.25]
[57,16.91,16.079999999999998,15.27,14.48]
[58,17.190000000000001,16.350000000000001,15.52,14.72]
[59,17.489999999999998,16.62,15.78,14.96]
[60,17.79,16.91,16.05,15.21]
[61,18.100000000000001,17.2,16.329999999999998,15.48]
[62,18.43,17.510000000000002,16.62,15.75]
[63,18.77,17.84,16.93,16.04]
[64,19.14,18.18,17.25,16.34]
[65,18.989999999999998,18.54,17.59,16.66]
[66,0,18.39,17.95,17]
[67,0,0,17.79,17.350000000000001]
[68,0,0,0,17.190000000000001]

{"sheet":"x-609","index":51,"n_rows":45,"n_cols":3,"rows_kept":45,"cut":false,"hidden":false,"merged":[]}
["Government Actuary's Department"]
[{"$f":"IF(TITLE=\"> Enter workbook title here\",\"Enter workbook title in Cover sheet\",TITLE)","v":"Local Government Pension Scheme (LGPS) - Consolidated Factor Spreadsheet"}]
[{"$f":"TABLE_FACTOR_TYPE&\" - x-\"&TABLE_SERIES_NUMBER","v":"Scheme pays LTA - x-609"}]
[]
[]
["Data Item","Factor Table Information"]
["Scheme","LGPS_EW"]
["Section","All"]
["Factor Type","Scheme pays LTA"]
["Description","Limit on total amount of benefits - Lifetime allowance - Factors for calculating LTA debit (non ill-health cases)"]
["Gender","Male & Female"]
["Factor Age/Period Definition","Age last birthday at retirement"]
["Section Number",0]
["Series Number",609]
["Table Reference","0-609"]
["Table Reference in Guidance","Table A"]
["Related Factor Guidance Note","Limit on Total Amount of Benefits – Lifetime Allowance 14 April 2016"]
["Date Factors Issued to Client","2023-07-27"]
["Date Factors Implemented (if known)","2023-07-28"]
["Factor Status","Issued"]
[]
[null,{"$f":"HYPERLINK(\"#'Factor List'!A1\",\"Back to Factor List\")","v":"Back to Factor List"}]
[]
[]
["Age","Gross pension of £1 per annum - Males","Gross pension of £1 per annum - Females"]
[55,24.92,24.92]
[56,24.35,24.35]
[57,23.77,23.77]
[58,23.18,23.18]
[59,22.6,22.6]
[60,22,22]
[61,21.41,21.41]
[62,20.81,20.81]
[63,20.22,20.22]
[64,19.62,19.62]
[65,18.989999999999998,18.989999999999998]
[66,18.309999999999999,18.309999999999999]
[67,17.64,17.64]
[68,16.96,16.96]
[69,16.28,16.28]
[70,15.6,15.6]
[71,14.92,14.92]
[72,14.25,14.25]
[73,13.59,13.59]
[74,12.94,12.94]

{"sheet":"x-610","index":52,"n_rows":73,"n_cols":3,"rows_kept":73,"cut":false,"hidden":false,"merged":[]}
["Government Actuary's Department"]
[{"$f":"IF(TITLE=\"> Enter workbook title here\",\"Enter workbook title in Cover sheet\",TITLE)","v":"Local Government Pension Scheme (LGPS) - Consolidated Factor Spreadsheet"}]
[{"$f":"TABLE_FACTOR_TYPE&\" - x-\"&TABLE_SERIES_NUMBER","v":"Scheme pays LTA - x-610"}]
[]
[]
["Data Item","Factor Table Information"]
["Scheme","LGPS_EW"]
["Section","All"]
["Factor Type","Scheme pays LTA"]
["Description","Limit on total amount of benefits - Lifetime allowance - Factors for calculating LTA debit (retirement in ill health)"]
["Gender","Male & Female"]
["Factor Age/Period Definition","Age last birthday at retirement"]
["Section Number",0]
["Series Number",610]
["Table Reference","0-610"]
["Table Reference in Guidance","Table B"]
["Related Factor Guidance Note","Limit on Total Amount of Benefits – Lifetime Allowance 14 April 2016"]
["Date Factors Issued to Client","2023-07-27"]
["Date Factors Implemented (if known)","2023-07-28"]
["Factor Status","Issued"]
[]
[null,{"$f":"HYPERLINK(\"#'Factor List'!A1\",\"Back to Factor List\")","v":"Back to Factor List"}]
[]
[]
["Age","Gross Pension of £1 per annum - Male Factor","Gross Pension of £1 per annum - Female Factor"]
[20,30.94,30.94]
[21,30.7,30.7]
[22,30.47,30.47]
[23,30.24,30.24]
[24,30,30]
[25,29.76,29.76]
[26,29.52,29.52]
[27,29.28,29.28]
[28,29.04,29.04]
[29,28.81,28.81]
[30,28.58,28.58]
[31,28.35,28.35]
[32,28.12,28.12]
[33,27.89,27.89]
[34,27.66,27.66]
[35,27.43,27.43]
[36,27.19,27.19]
[37,26.95,26.95]
[38,26.7,26.7]
[39,26.44,26.44]
[40,26.18,26.18]
[41,25.91,25.91]
[42,25.63,25.63]
[43,25.34,25.34]
[44,25.04,25.04]
[45,24.74,24.74]
[46,24.43,24.43]
[47,24.11,24.11]
[48,23.78,23.78]
[49,23.43,23.43]
[50,23.08,23.08]
[51,22.71,22.71]
[52,22.32,22.32]
[53,21.92,21.92]
[54,21.5,21.5]
[55,21.07,21.07]
[56,20.63,20.63]
[57,20.170000000000002,20.170000000000002]
[58,19.71,19.71]
[59,19.22,19.22]
[60,18.73,18.73]
[61,18.21,18.21]
[62,17.690000000000001,17.690000000000001]
[63,17.149999999999999,17.149999999999999]
[64,16.61,16.61]
[65,16.05,16.05]
[66,15.47,15.47]
[67,14.89,14.89]

{"sheet":"x-701","index":53,"n_rows":73,"n_cols":49,"rows_kept":73,"cut":false,"hidden":false,"merged":[]}
["Government Actuary's Department"]
[{"$f":"IF(TITLE=\"> Enter workbook title here\",\"Enter workbook title in Cover sheet\",TITLE)","v":"Local Government Pension Scheme (LGPS) - Consolidated Factor Spreadsheet"}]
["Added pension - x-701"]
[]
[]
["Data Item","Factor Table Information"]
["Scheme","LGPS_EW"]
["Section","pre 2012"]
["Factor Type","Added pension"]
["Description","Additional own pension - regular monthly contributions - Males (purchase of additional pension prior to April 2012) - (monthly payment (£) to purchase £250 additional pension)"]
["Gender","Male"]
["Factor Age/Period Definition","Age at first contribution"]
["Section Number",0]
["Series Number",701]
["Table Reference","0-701"]
["Table Reference in Guidance","Table A"]
["Related Factor Guidance Note","LGPS EW Purchase of additional pension - Elections before 1 April 2012. 5 May 2021"]
["Date Factors Issued to Client","2023-09-26"]
["Date Factors Implemented (if known)","2023-10-02"]
["Factor Status","Issued"]
[]
[null,{"$f":"HYPERLINK(\"#'Factor List'!A1\",\"Back to Factor List\")","v":"Back to Factor List"}]
[]
[]
["Age","Contract length (years) 1","Contract length (years) 2","Contract length (years) 3","Contract length (years) 4","Contract length (years) 5","Contract length (years) 6","Contract length (years) 7","Contract length (years) 8","Contract length (years) 9","Contract length (years) 10","Contract length (years) 11","Contract length (years) 12","Contract length (years) 13","Contract length (years) 14","Contract length (years) 15","Contract length (years) 16","Contract length (years) 17","Contract length (years) 18","Contract length (years) 19","Contract length (years) 20","Contract length (years) 21","Contract length (years) 22","Contract length (years) 23","Contract length (years) 24","Contract length (years) 25","Contract length (years) 26","Contract length (years) 27","Contract length (years) 28","Contract length (years) 29","Contract length (years) 30","Contract length (years) 31","Contract length (years) 32","Contract length (years) 33","Contract length (years) 34","Contract length (years) 35","Contract length (years) 36","Contract length (years) 37","Contract length (years) 38","Contract length (years) 39","Contract length (years) 40","Contract length (years) 41","Contract length (years) 42","Contract length (years) 43","Contract length (years) 44","Contract length (years) 45","Contract length (years) 46","Contract length (years) 47","Contract length (years) 48"]
[16,null,null,null,null,null,null,null,null,null,null,null,21,19.72,18.62,17.68,16.850000000000001,16.13,15.49,14.91,14.4,13.94,13.52,13.14,12.8,12.48,12.19,11.93,11.68,11.45,11.24,11.05,10.87,10.7,10.54,10.39,10.26,10.130000000000001,10.01,9.89,9.7899999999999991,9.69,9.6,9.51,9.43,9.35,9.2799999999999994,9.2100000000000009,9.15]
[17,null,null,null,null,null,null,null,null,null,null,null,21.29,19.989999999999998,18.88,17.920000000000002,17.079999999999998,16.350000000000001,15.7,15.12,14.6,14.13,13.71,13.32,12.97,12.65,12.36,12.09,11.84,11.61,11.4,11.2,11.02,10.85,10.69,10.54,10.4,10.27,10.15,10.029999999999999,9.93,9.83,9.74,9.65,9.57,9.49,9.42,9.35]
[18,null,null,null,null,null,null,null,null,null,null,null,21.58,20.260000000000002,19.13,18.16,17.309999999999999,16.57,15.91,15.32,14.8,14.32,13.9,13.51,13.15,12.83,12.53,12.26,12.01,11.77,11.56,11.36,11.17,11,10.84,10.69,10.55,10.42,10.29,10.18,10.07,9.9700000000000006,9.8800000000000008,9.7899999999999991,9.7100000000000009,9.6300000000000008,9.56]
[19,null,null,null,null,null,null,null,null,null,null,null,21.87,20.53,19.39,18.41,17.55,16.8,16.13,15.53,15,14.52,14.09,13.69,13.33,13.01,12.7,12.43,12.17,11.94,11.72,11.52,11.33,11.15,10.99,10.84,10.7,10.57,10.44,10.33,10.220000000000001,10.119999999999999,10.02,9.93,9.85,9.77]
[20,null,null,null,null,null,null,null,null,null,null,null,22.16,20.81,19.66,18.66,17.79,17.03,16.350000000000001,15.75,15.21,14.72,14.28,13.88,13.52,13.18,12.88,12.6,12.34,12.1,11.88,11.68,11.49,11.31,11.15,10.99,10.85,10.72,10.59,10.48,10.37,10.27,10.17,10.08,10]
[21,null,null,null,null,null,null,null,null,null,null,null,22.47,21.1,19.93,18.91,18.03,17.260000000000002,16.57,15.96,15.41,14.92,14.48,14.07,13.7,13.37,13.06,12.78,12.51,12.27,12.05,11.84,11.65,11.47,11.31,11.15,11.01,10.87,10.75,10.63,10.52,10.42,10.32,10.24]
[22,null,null,null,null,null,null,null,null,null,null,null,22.77,21.38,20.2,19.170000000000002,18.28,17.489999999999998,16.8,16.18,15.63,15.13,14.68,14.27,13.89,13.55,13.24,12.95,12.69,12.45,12.22,12.01,11.82,11.64,11.47,11.31,11.17,11.03,10.91,10.79,10.68,10.58,10.48]
[23,null,null,null,null,null,null,null,null,null,null,null,23.08,21.67,20.47,19.43,18.53,17.73,17.03,16.399999999999999,15.84,15.34,14.88,14.46,14.09,13.74,13.43,13.14,12.87,12.62,12.39,12.18,11.99,11.8,11.63,11.48,11.33,11.19,11.07,10.95,10.84,10.74]
[24,null,null,null,null,null,null,null,null,null,null,null,23.39,21.97,20.75,19.7,18.78,17.98,17.260000000000002,16.63,16.059999999999999,15.55,15.08,14.67,14.28,13.93,13.61,13.32,13.05,12.8,12.57,12.36,12.16,11.97,11.8,11.65,11.5,11.36,11.23,11.12,11.01]
[25,null,null,null,null,null,null,null,null,null,null,null,23.71,22.27,21.03,19.97,19.04,18.22,17.5,16.86,16.28,15.76,15.29,14.87,14.48,14.13,13.81,13.51,13.23,12.98,12.75,12.53,12.33,12.15,11.98,11.82,11.67,11.53,11.41,11.29]
[26,null,null,null,null,null,null,null,null,null,null,null,24.03,22.57,21.32,20.239999999999998,19.3,18.47,17.739999999999998,17.09,16.510000000000002,15.98,15.51,15.08,14.69,14.33,14,13.7,13.42,13.17,12.93,12.72,12.52,12.33,12.16,12,11.85,11.71,11.58]
[27,null,null,null,null,null,null,null,null,null,null,null,24.36,22.88,21.61,20.52,19.559999999999999,18.73,17.989999999999998,17.329999999999998,16.739999999999998,16.2,15.72,15.29,14.89,14.53,14.2,13.9,13.62,13.36,13.12,12.9,12.7,12.51,12.34,12.18,12.03,11.89]
[28,null,null,null,null,null,null,null,null,null,null,null,24.69,23.19,21.91,20.8,19.829999999999998,18.989999999999998,18.23,17.57,16.97,16.43,15.95,15.5,15.1,14.74,14.4,14.1,13.82,13.56,13.32,13.1,12.89,12.7,12.53,12.37,12.22]
[29,null,null,null,null,null,null,null,null,null,null,null,25.03,23.51,22.21,21.09,20.11,19.25,18.489999999999998,17.809999999999999,17.21,16.66,16.170000000000002,15.72,15.32,14.95,14.61,14.3,14.02,13.76,13.51,13.29,13.09,12.9,12.72,12.56]
[30,null,null,null,null,null,null,null,null,null,null,null,25.37,23.83,22.51,21.38,20.39,19.52,18.75,18.059999999999999,17.45,16.899999999999999,16.399999999999999,15.95,15.54,15.17,14.83,14.51,14.23,13.96,13.72,13.49,13.29,13.1,12.92]
[31,null,null,null,null,null,null,null,null,null,null,null,25.72,24.16,22.82,21.67,20.67,19.79,19.010000000000002,18.32,17.7,17.14,16.64,16.18,15.77,15.39,15.04,14.73,14.44,14.17,13.93,13.7,13.5,13.31]
[32,null,null,null,null,null,null,null,null,null,null,null,26.07,24.49,23.14,21.97,20.96,20.07,19.28,18.57,17.95,17.38,16.88,16.41,16,15.62,15.27,14.95,14.66,14.39,14.15,13.92,13.71]
[33,null,null,null,null,null,null,null,null,null,null,null,26.43,24.83,23.46,22.28,21.25,20.350000000000001,19.55,18.84,18.2,17.63,17.12,16.66,16.23,15.85,15.5,15.18,14.88,14.62,14.37,14.14]
[34,null,null,null,null,null,null,null,null,null,null,null,26.8,25.17,23.79,22.59,21.55,20.64,19.829999999999998,19.11,18.47,17.89,17.37,16.899999999999999,16.48,16.09,15.74,15.41,15.12,14.85,14.6]
[35,null,null,null,null,null,null,null,null,null,null,null,27.17,25.52,24.12,22.91,21.86,20.93,20.11,19.39,18.739999999999998,18.16,17.63,17.16,16.73,16.34,15.98,15.66,15.36,15.09]
[36,null,null,null,null,null,null,null,null,null,null,null,27.55,25.88,24.46,23.23,22.17,21.23,20.399999999999999,19.670000000000002,19.010000000000002,18.43,17.899999999999999,17.420000000000002,16.989999999999998,16.59,16.23,15.91,15.61]
[37,null,null,null,null,null,null,null,null,null,null,null,27.93,26.25,24.81,23.57,22.49,21.54,20.7,19.96,19.3,18.71,18.170000000000002,17.690000000000001,17.25,16.86,16.5,16.170000000000002]
[38,null,null,null,null,null,null,null,null,null,null,null,28.33,26.62,25.16,23.91,22.81,21.86,21.01,20.260000000000002,19.59,18.989999999999998,18.45,17.97,17.53,17.13,16.77]
[39,null,null,null,null,null,null,null,null,null,null,null,28.73,27,25.52,24.25,23.15,22.18,21.33,20.57,19.89,19.29,18.75,18.260000000000002,17.82,17.420000000000002]
[40,null,null,null,null,null,null,null,null,null,null,null,29.14,27.39,25.9,24.61,23.49,22.51,21.65,20.89,20.21,19.600000000000001,19.05,18.559999999999999,18.11]
[41,null,null,null,null,null,null,null,null,null,null,null,29.56,27.79,26.28,24.98,23.85,22.86,21.99,21.22,20.53,19.920000000000002,19.37,18.87]
[42,null,null,null,null,null,null,null,null,null,null,null,29.99,28.2,26.67,25.35,24.21,23.21,22.34,21.56,20.86,20.25,19.690000000000001]
[43,null,null,null,null,null,null,null,null,null,null,null,30.43,28.62,27.07,25.74,24.59,23.58,22.7,21.91,21.21,20.59]
[44,null,null,null,null,null,null,null,null,null,null,null,30.88,29.05,27.49,26.15,24.98,23.96,23.07,22.28,21.58]
[45,null,null,null,null,null,null,null,null,null,null,null,31.35,29.5,27.92,26.56,25.39,24.36,23.46,22.67]
[46,null,null,null,null,null,null,null,null,null,null,null,31.84,29.96,28.37,27,25.81,24.78,23.87]
[47,null,null,null,null,null,null,null,null,null,null,null,32.340000000000003,30.44,28.83,27.45,26.26,25.22]
[48,null,null,null,null,null,null,null,null,null,null,null,32.86,30.95,29.32,27.93,26.72]
[49,null,null,null,null,null,null,null,null,null,null,null,33.4,31.47,29.83,28.43]
[50,null,null,null,null,null,null,null,null,null,null,null,33.97,32.020000000000003,30.37]
[51,null,null,null,null,null,null,null,null,null,null,null,34.57,32.6]
[52,null,null,null,null,null,null,null,null,null,null,null,35.200000000000003]
[53]
[54]
[55]
[56]
[57]
[58]
[59]
[60]
[61]
[62]
[63]

{"sheet":"x-702","index":54,"n_rows":73,"n_cols":49,"rows_kept":73,"cut":false,"hidden":false,"merged":[]}
["Government Actuary's Department"]
[{"$f":"IF(TITLE=\"> Enter workbook title here\",\"Enter workbook title in Cover sheet\",TITLE)","v":"Local Government Pension Scheme (LGPS) - Consolidated Factor Spreadsheet"}]
["Added pension - x-702"]
[]
[]
["Data Item","Factor Table Information"]
["Scheme","LGPS_EW"]
["Section","pre 2012"]
["Factor Type","Added pension"]
["Description","Additional own pension - regular monthly contributions - Females (purchase of additional pension prior to April 2012) - (monthly payment (£) to purchase £250 additional pension)"]
["Gender","Female"]
["Factor Age/Period Definition","Age at first contribution"]
["Section Number",0]
["Series Number",702]
["Table Reference","0-702"]
["Table Reference in Guidance","Table B"]
["Related Factor Guidance Note","LGPS EW Purchase of additional pension - Elections before 1 April 2012. 5 May 2021"]
["Date Factors Issued to Client","2023-09-26"]
["Date Factors Implemented (if known)","2023-10-02"]
["Factor Status","Issued"]
[]
[null,{"$f":"HYPERLINK(\"#'Factor List'!A1\",\"Back to Factor List\")","v":"Back to Factor List"}]
[]
[]
["Age","Contract length (years) 1","Contract length (years) 2","Contract length (years) 3","Contract length (years) 4","Contract length (years) 5","Contract length (years) 6","Contract length (years) 7","Contract length (years) 8","Contract length (years) 9","Contract length (years) 10","Contract length (years) 11","Contract length (years) 12","Contract length (years) 13","Contract length (years) 14","Contract length (years) 15","Contract length (years) 16","Contract length (years) 17","Contract length (years) 18","Contract length (years) 19","Contract length (years) 20","Contract length (years) 21","Contract length (years) 22","Contract length (years) 23","Contract length (years) 24","Contract length (years) 25","Contract length (years) 26","Contract length (years) 27","Contract length (years) 28","Contract length (years) 29","Contract length (years) 30","Contract length (years) 31","Contract length (years) 32","Contract length (years) 33","Contract length (years) 34","Contract length (years) 35","Contract length (years) 36","Contract length (years) 37","Contract length (years) 38","Contract length (years) 39","Contract length (years) 40","Contract length (years) 41","Contract length (years) 42","Contract length (years) 43","Contract length (years) 44","Contract length (years) 45","Contract length (years) 46","Contract length (years) 47","Contract length (years) 48"]
[16,null,null,null,null,null,null,null,null,null,null,null,22.78,21.39,20.2,19.170000000000002,18.28,17.489999999999998,16.79,16.170000000000002,15.61,15.11,14.66,14.25,13.87,13.53,13.21,12.92,12.65,12.41,12.18,11.96,11.77,11.58,11.41,11.25,11.1,10.96,10.82,10.7,10.58,10.48,10.37,10.28,10.19,10.1,10.02,9.9499999999999993,9.8800000000000008]
[17,null,null,null,null,null,null,null,null,null,null,null,23.1,21.69,20.48,19.440000000000001,18.53,17.73,17.02,16.39,15.83,15.32,14.86,14.44,14.06,13.71,13.4,13.1,12.83,12.58,12.35,12.13,11.93,11.74,11.57,11.41,11.25,11.11,10.98,10.85,10.74,10.63,10.52,10.43,10.34,10.25,10.17,10.09]
[18,null,null,null,null,null,null,null,null,null,null,null,23.42,21.99,20.76,19.71,18.79,17.98,17.260000000000002,16.62,16.05,15.53,15.07,14.65,14.26,13.91,13.58,13.28,13.01,12.76,12.52,12.3,12.1,11.91,11.73,11.57,11.42,11.27,11.14,11.01,10.89,10.78,10.68,10.58,10.49,10.4,10.32]
[19,null,null,null,null,null,null,null,null,null,null,null,23.74,22.29,21.05,19.98,19.05,18.23,17.5,16.850000000000001,16.27,15.75,15.28,14.85,14.46,14.1,13.77,13.47,13.19,12.94,12.7,12.48,12.27,12.08,11.9,11.73,11.58,11.43,11.3,11.17,11.05,10.94,10.83,10.73,10.64,10.56]
[20,null,null,null,null,null,null,null,null,null,null,null,24.07,22.6,21.34,20.260000000000002,19.309999999999999,18.48,17.739999999999998,17.09,16.5,15.97,15.49,15.06,14.66,14.3,13.97,13.66,13.38,13.12,12.88,12.65,12.44,12.25,12.07,11.9,11.74,11.6,11.46,11.33,11.21,11.1,10.99,10.89,10.8]
[21,null,null,null,null,null,null,null,null,null,null,null,24.4,22.91,21.64,20.54,19.579999999999998,18.739999999999998,17.989999999999998,17.32,16.73,16.190000000000001,15.71,15.27,14.87,14.5,14.16,13.85,13.57,13.3,13.06,12.83,12.62,12.43,12.24,12.07,11.91,11.77,11.63,11.5,11.38,11.26,11.16,11.06]
[22,null,null,null,null,null,null,null,null,null,null,null,24.74,23.23,21.94,20.82,19.850000000000001,19,18.239999999999998,17.57,16.96,16.420000000000002,15.93,15.48,15.07,14.7,14.36,14.05,13.76,13.49,13.24,13.01,12.8,12.6,12.42,12.25,12.09,11.94,11.8,11.67,11.55,11.43,11.33]
[23,null,null,null,null,null,null,null,null,null,null,null,25.08,23.55,22.24,21.11,20.13,19.260000000000002,18.489999999999998,17.809999999999999,17.2,16.649999999999999,16.149999999999999,15.7,15.29,14.91,14.56,14.25,13.95,13.68,13.43,13.2,12.99,12.79,12.6,12.43,12.26,12.11,11.97,11.84,11.72,11.6]
[24,null,null,null,null,null,null,null,null,null,null,null,25.43,23.88,22.55,21.4,20.41,19.53,18.75,18.059999999999999,17.440000000000001,16.88,16.38,15.92,15.5,15.12,14.77,14.45,14.15,13.88,13.62,13.39,13.17,12.97,12.78,12.61,12.44,12.29,12.15,12.02,11.9]
[25,null,null,null,null,null,null,null,null,null,null,null,25.78,24.21,22.86,21.7,20.69,19.8,19.010000000000002,18.309999999999999,17.68,17.12,16.61,16.14,15.72,15.33,14.98,14.65,14.35,14.08,13.82,13.58,13.36,13.16,12.97,12.79,12.63,12.48,12.33,12.2]
[26,null,null,null,null,null,null,null,null,null,null,null,26.14,24.54,23.18,22,20.98,20.079999999999998,19.28,18.57,17.93,17.36,16.84,16.37,15.94,15.55,15.19,14.86,14.56,14.28,14.02,13.78,13.56,13.35,13.16,12.98,12.82,12.66,12.52]
[27,null,null,null,null,null,null,null,null,null,null,null,26.5,24.88,23.5,22.31,21.27,20.350000000000001,19.55,18.829999999999998,18.18,17.600000000000001,17.079999999999998,16.600000000000001,16.170000000000002,15.77,15.41,15.07,14.77,14.48,14.22,13.98,13.76,13.55,13.36,13.18,13.01,12.86]
[28,null,null,null,null,null,null,null,null,null,null,null,26.87,25.23,23.83,22.62,21.57,20.64,19.82,19.09,18.440000000000001,17.850000000000001,17.32,16.84,16.399999999999999,16,15.63,15.29,14.98,14.7,14.43,14.19,13.96,13.75,13.56,13.38,13.21]
[29,null,null,null,null,null,null,null,null,null,null,null,27.24,25.58,24.16,22.93,21.87,20.93,20.100000000000001,19.36,18.7,18.100000000000001,17.559999999999999,17.079999999999998,16.63,16.23,15.85,15.51,15.2,14.91,14.65,14.4,14.17,13.96,13.77,13.59]
[30,null,null,null,null,null,null,null,null,null,null,null,27.62,25.93,24.5,23.25,22.17,21.22,20.38,19.63,18.96,18.36,17.809999999999999,17.32,16.87,16.46,16.079999999999998,15.74,15.42,15.13,14.86,14.62,14.39,14.18,13.98]
[31,null,null,null,null,null,null,null,null,null,null,null,28,26.29,24.84,23.58,22.48,21.52,20.67,19.91,19.23,18.62,18.07,17.57,17.11,16.7,16.32,15.97,15.65,15.36,15.09,14.84,14.61,14.4]
[32,null,null,null,null,null,null,null,null,null,null,null,28.39,26.66,25.18,23.91,22.8,21.82,20.96,20.190000000000001,19.5,18.89,18.329999999999998,17.82,17.36,16.940000000000001,16.559999999999999,16.21,15.89,15.59,15.32,15.07,14.84]
[33,null,null,null,null,null,null,null,null,null,null,null,28.78,27.03,25.54,24.25,23.12,22.13,21.26,20.48,19.78,19.16,18.59,18.079999999999998,17.62,17.2,16.809999999999999,16.45,16.13,15.83,15.56,15.3]
[34,null,null,null,null,null,null,null,null,null,null,null,29.19,27.41,25.9,24.59,23.45,22.45,21.56,20.77,20.07,19.440000000000001,18.87,18.350000000000001,17.88,17.45,17.059999999999999,16.7,16.38,16.079999999999998,15.8]
[35,null,null,null,null,null,null,null,null,null,null,null,29.59,27.8,26.26,24.94,23.78,22.77,21.87,21.07,20.36,19.72,19.14,18.62,18.149999999999999,17.72,17.32,16.96,16.63,16.329999999999998]
[36,null,null,null,null,null,null,null,null,null,null,null,30.01,28.19,26.63,25.29,24.12,23.09,22.19,21.38,20.66,20.010000000000002,19.43,18.899999999999999,18.420000000000002,17.989999999999998,17.59,17.23,16.899999999999999]
[37,null,null,null,null,null,null,null,null,null,null,null,30.43,28.59,27.01,25.65,24.47,23.43,22.51,21.69,20.97,20.309999999999999,19.72,19.190000000000001,18.71,18.27,17.87,17.5]
[38,null,null,null,null,null,null,null,null,null,null,null,30.86,28.99,27.4,26.02,24.82,23.77,22.84,22.02,21.28,20.62,20.02,19.489999999999998,19,18.559999999999999,18.16]
[39,null,null,null,null,null,null,null,null,null,null,null,31.3,29.41,27.79,26.4,25.18,24.12,23.18,22.35,21.6,20.93,20.329999999999998,19.79,19.3,18.86]
[40,null,null,null,null,null,null,null,null,null,null,null,31.75,29.83,28.19,26.78,25.55,24.48,23.53,22.69,21.93,21.26,20.66,20.11,19.62]
[41,null,null,null,null,null,null,null,null,null,null,null,32.200000000000003,30.26,28.6,27.18,25.93,24.85,23.89,23.04,22.28,21.6,20.99,20.440000000000001]
[42,null,null,null,null,null,null,null,null,null,null,null,32.67,30.7,29.03,27.58,26.33,25.23,24.26,23.4,22.63,21.95,21.33]
[43,null,null,null,null,null,null,null,null,null,null,null,33.15,31.16,29.46,28,26.73,25.62,24.64,23.77,23,22.31]
[44,null,null,null,null,null,null,null,null,null,null,null,33.64,31.62,29.91,28.43,27.14,26.02,25.03,24.16,23.38]
[45,null,null,null,null,null,null,null,null,null,null,null,34.14,32.1,30.37,28.87,27.58,26.44,25.44,24.56]
[46,null,null,null,null,null,null,null,null,null,null,null,34.659999999999997,32.6,30.84,29.33,28.02,26.88,25.87]
[47,null,null,null,null,null,null,null,null,null,null,null,35.19,33.11,31.33,29.81,28.49,27.33]
[48,null,null,null,null,null,null,null,null,null,null,null,35.75,33.64,31.84,30.31,28.97]
[49,null,null,null,null,null,null,null,null,null,null,null,36.32,34.19,32.380000000000003,30.82]
[50,null,null,null,null,null,null,null,null,null,null,null,36.92,34.76,32.94]
[51,null,null,null,null,null,null,null,null,null,null,null,37.54,35.369999999999997]
[52,null,null,null,null,null,null,null,null,null,null,null,38.19]
[53]
[54]
[55]
[56]
[57]
[58]
[59]
[60]
[61]
[62]
[63]

{"sheet":"x-703","index":55,"n_rows":73,"n_cols":49,"rows_kept":73,"cut":false,"hidden":false,"merged":[]}
["Government Actuary's Department"]
[{"$f":"IF(TITLE=\"> Enter workbook title here\",\"Enter workbook title in Cover sheet\",TITLE)","v":"Local Government Pension Scheme (LGPS) - Consolidated Factor Spreadsheet"}]
["Added pension - x-703"]
[]
[]
["Data Item","Factor Table Information"]
["Scheme","LGPS_EW"]
["Section","pre 2012"]
["Factor Type","Added pension"]
["Description","Additional own and dependant's pension - regular monthly contributions - Males (purchase of additional pension prior to April 2012) - (monthly payment (£) to purchase £250 additional pension)"]
["Gender","Male"]
["Factor Age/Period Definition","Age at first contribution"]
["Section Number",0]
["Series Number",703]
["Table Reference","0-703"]
["Table Reference in Guidance","Table C"]
["Related Factor Guidance Note","LGPS EW Purchase of additional pension - Elections before 1 April 2012. 5 May 2021"]
["Date Factors Issued to Client","2023-09-26"]
["Date Factors Implemented (if known)","2023-10-02"]
["Factor Status","Issued"]
[]
[null,{"$f":"HYPERLINK(\"#'Factor List'!A1\",\"Back to Factor List\")","v":"Back to Factor List"}]
[]
[]
["Age","Contract length (years) 1","Contract length (years) 2","Contract length (years) 3","Contract length (years) 4","Contract length (years) 5","Contract length (years) 6","Contract length (years) 7","Contract length (years) 8","Contract length (years) 9","Contract length (years) 10","Contract length (years) 11","Contract length (years) 12","Contract length (years) 13","Contract length (years) 14","Contract length (years) 15","Contract length (years) 16","Contract length (years) 17","Contract length (years) 18","Contract length (years) 19","Contract length (years) 20","Contract length (years) 21","Contract length (years) 22","Contract length (years) 23","Contract length (years) 24","Contract length (years) 25","Contract length (years) 26","Contract length (years) 27","Contract length (years) 28","Contract length (years) 29","Contract length (years) 30","Contract length (years) 31","Contract length (years) 32","Contract length (years) 33","Contract length (years) 34","Contract length (years) 35","Contract length (years) 36","Contract length (years) 37","Contract length (years) 38","Contract length (years) 39","Contract length (years) 40","Contract length (years) 41","Contract length (years) 42","Contract length (years) 43","Contract length (years) 44","Contract length (years) 45","Contract length (years) 46","Contract length (years) 47","Contract length (years) 48"]
[16,null,null,null,null,null,null,null,null,null,null,null,23.35,21.92,20.71,19.649999999999999,18.739999999999998,17.93,17.22,16.579999999999998,16.010000000000002,15.5,15.03,14.61,14.23,13.88,13.56,13.26,12.99,12.73,12.5,12.28,12.08,11.89,11.72,11.55,11.4,11.26,11.13,11,10.88,10.77,10.67,10.57,10.48,10.4,10.32,10.24,10.17]
[17,null,null,null,null,null,null,null,null,null,null,null,23.79,22.34,21.1,20.03,19.09,18.27,17.54,16.899999999999999,16.32,15.79,15.32,14.89,14.5,14.14,13.82,13.51,13.24,12.98,12.74,12.52,12.31,12.12,11.95,11.78,11.62,11.48,11.34,11.22,11.1,10.99,10.88,10.78,10.69,10.61,10.53,10.45]
[18,null,null,null,null,null,null,null,null,null,null,null,24.3,22.82,21.55,20.45,19.5,18.66,17.920000000000002,17.260000000000002,16.670000000000002,16.13,15.65,15.21,14.81,14.45,14.11,13.8,13.52,13.26,13.02,12.79,12.58,12.39,12.21,12.04,11.88,11.73,11.59,11.46,11.34,11.23,11.12,11.02,10.93,10.84,10.76]
[19,null,null,null,null,null,null,null,null,null,null,null,24.75,23.24,21.95,20.83,19.86,19.010000000000002,18.25,17.579999999999998,16.98,16.43,15.94,15.5,15.09,14.72,14.38,14.06,13.78,13.51,13.26,13.03,12.82,12.62,12.44,12.27,12.11,11.96,11.82,11.69,11.56,11.45,11.34,11.24,11.15,11.06]
[20,null,null,null,null,null,null,null,null,null,null,null,25.08,23.55,22.25,21.12,20.13,19.27,18.5,17.82,17.21,16.66,16.16,15.71,15.3,14.92,14.58,14.26,13.97,13.7,13.45,13.22,13,12.8,12.62,12.44,12.28,12.13,11.99,11.86,11.73,11.62,11.51,11.41,11.32]
[21,null,null,null,null,null,null,null,null,null,null,null,25.43,23.88,22.55,21.41,20.41,19.53,18.760000000000002,18.07,17.45,16.89,16.38,15.93,15.51,15.13,14.78,14.46,14.16,13.89,13.64,13.4,13.19,12.98,12.8,12.62,12.46,12.31,12.16,12.03,11.91,11.79,11.68,11.58]
[22,null,null,null,null,null,null,null,null,null,null,null,25.77,24.2,22.86,21.7,20.69,19.8,19.010000000000002,18.309999999999999,17.690000000000001,17.12,16.61,16.149999999999999,15.73,15.34,14.99,14.66,14.36,14.09,13.83,13.59,13.37,13.17,12.98,12.8,12.64,12.49,12.34,12.21,12.09,11.97,11.86]
[23,null,null,null,null,null,null,null,null,null,null,null,26.13,24.53,23.17,22,20.97,20.07,19.28,18.57,17.93,17.36,16.84,16.37,15.95,15.56,15.2,14.87,14.57,14.29,14.03,13.79,13.57,13.36,13.17,12.99,12.83,12.67,12.53,12.39,12.27,12.15]
[24,null,null,null,null,null,null,null,null,null,null,null,26.48,24.87,23.49,22.3,21.26,20.350000000000001,19.54,18.82,18.18,17.600000000000001,17.079999999999998,16.600000000000001,16.170000000000002,15.77,15.41,15.08,14.77,14.49,14.23,13.99,13.76,13.56,13.36,13.18,13.02,12.86,12.72,12.58,12.46]
[25,null,null,null,null,null,null,null,null,null,null,null,26.84,25.21,23.81,22.61,21.55,20.63,19.809999999999999,19.079999999999998,18.43,17.84,17.309999999999999,16.829999999999998,16.399999999999999,16,15.63,15.29,14.98,14.7,14.43,14.19,13.96,13.75,13.56,13.38,13.21,13.06,12.91,12.78]
[26,null,null,null,null,null,null,null,null,null,null,null,27.21,25.55,24.14,22.92,21.85,20.91,20.09,19.350000000000001,18.690000000000001,18.09,17.559999999999999,17.07,16.63,16.22,15.85,15.51,15.2,14.91,14.64,14.4,14.17,13.96,13.76,13.58,13.41,13.26,13.11]
[27,null,null,null,null,null,null,null,null,null,null,null,27.58,25.9,24.47,23.23,22.15,21.2,20.36,19.62,18.95,18.350000000000001,17.8,17.309999999999999,16.86,16.45,16.079999999999998,15.73,15.42,15.13,14.86,14.61,14.38,14.17,13.97,13.79,13.62,13.46]
[28,null,null,null,null,null,null,null,null,null,null,null,27.96,26.26,24.8,23.55,22.46,21.5,20.65,19.89,19.21,18.600000000000001,18.05,17.559999999999999,17.100000000000001,16.690000000000001,16.309999999999999,15.96,15.64,15.35,15.08,14.83,14.6,14.38,14.18,14,13.83]
[29,null,null,null,null,null,null,null,null,null,null,null,28.34,26.62,25.15,23.87,22.77,21.79,20.93,20.170000000000002,19.48,18.87,18.309999999999999,17.809999999999999,17.350000000000001,16.93,16.55,16.190000000000001,15.87,15.58,15.3,15.05,14.82,14.6,14.41,14.22]
[30,null,null,null,null,null,null,null,null,null,null,null,28.73,26.98,25.49,24.2,23.08,22.1,21.23,20.45,19.760000000000002,19.13,18.57,18.059999999999999,17.600000000000001,17.170000000000002,16.79,16.43,16.11,15.81,15.53,15.28,15.05,14.83,14.63]
[31,null,null,null,null,null,null,null,null,null,null,null,29.12,27.35,25.84,24.54,23.4,22.41,21.52,20.74,20.04,19.41,18.84,18.32,17.850000000000001,17.420000000000002,17.03,16.68,16.350000000000001,16.05,15.77,15.52,15.28,15.07]
[32,null,null,null,null,null,null,null,null,null,null,null,29.52,27.73,26.2,24.88,23.73,22.72,21.83,21.03,20.32,19.68,19.11,18.59,18.11,17.68,17.29,16.93,16.600000000000001,16.29,16.02,15.76,15.53]
[33,null,null,null,null,null,null,null,null,null,null,null,29.93,28.11,26.56,25.23,24.06,23.04,22.13,21.33,20.61,19.97,19.38,18.86,18.38,17.940000000000001,17.55,17.18,16.850000000000001,16.55,16.27,16.010000000000002]
[34,null,null,null,null,null,null,null,null,null,null,null,30.34,28.5,26.93,25.58,24.4,23.36,22.45,21.64,20.91,20.260000000000002,19.670000000000002,19.14,18.649999999999999,18.22,17.82,17.45,17.12,16.809999999999999,16.53]
[35,null,null,null,null,null,null,null,null,null,null,null,30.76,28.9,27.31,25.94,24.74,23.7,22.77,21.95,21.21,20.55,19.96,19.420000000000002,18.940000000000001,18.489999999999998,18.09,17.72,17.39,17.079999999999998]
[36,null,null,null,null,null,null,null,null,null,null,null,31.18,29.3,27.69,26.3,25.09,24.03,23.1,22.27,21.52,20.86,20.260000000000002,19.72,19.23,18.78,18.38,18.010000000000002,17.670000000000002]
[37,null,null,null,null,null,null,null,null,null,null,null,31.62,29.71,28.08,26.67,25.45,24.38,23.43,22.59,21.84,21.17,20.57,20.02,19.53,19.079999999999998,18.670000000000002,18.3]
[38,null,null,null,null,null,null,null,null,null,null,null,32.06,30.13,28.48,27.06,25.82,24.73,23.78,22.93,22.17,21.49,20.88,20.329999999999998,19.84,19.39,18.98]
[39,null,null,null,null,null,null,null,null,null,null,null,32.51,30.55,28.88,27.44,26.19,25.1,24.13,23.27,22.51,21.83,21.21,20.66,20.16,19.71]
[40,null,null,null,null,null,null,null,null,null,null,null,32.96,30.98,29.3,27.84,26.58,25.47,24.5,23.63,22.86,22.17,21.55,20.99,20.49]
[41,null,null,null,null,null,null,null,null,null,null,null,33.43,31.43,29.72,28.25,26.97,25.86,24.87,24,23.22,22.53,21.9,21.35]
[42,null,null,null,null,null,null,null,null,null,null,null,33.909999999999997,31.88,30.16,28.67,27.38,26.25,25.26,24.38,23.59,22.9,22.27]
[43,null,null,null,null,null,null,null,null,null,null,null,34.4,32.35,30.61,29.1,27.8,26.66,25.66,24.77,23.98,23.28]
[44,null,null,null,null,null,null,null,null,null,null,null,34.9,32.83,31.07,29.55,28.24,27.09,26.07,25.18,24.39]
[45,null,null,null,null,null,null,null,null,null,null,null,35.42,33.33,31.55,30.01,28.69,27.53,26.51,25.61]
[46,null,null,null,null,null,null,null,null,null,null,null,35.96,33.840000000000003,32.04,30.49,29.15,27.99,26.96]
[47,null,null,null,null,null,null,null,null,null,null,null,36.51,34.369999999999997,32.549999999999997,30.99,29.64,28.47]
[48,null,null,null,null,null,null,null,null,null,null,null,37.08,34.92,33.090000000000003,31.51,30.16]
[49,null,null,null,null,null,null,null,null,null,null,null,37.67,35.49,33.64,32.06]
[50,null,null,null,null,null,null,null,null,null,null,null,38.29,36.090000000000003,34.229999999999997]
[51,null,null,null,null,null,null,null,null,null,null,null,38.94,36.72]
[52,null,null,null,null,null,null,null,null,null,null,null,39.619999999999997]
[53]
[54]
[55]
[56]
[57]
[58]
[59]
[60]
[61]
[62]
[63]

{"sheet":"x-704","index":56,"n_rows":73,"n_cols":49,"rows_kept":73,"cut":false,"hidden":false,"merged":[]}
["Government Actuary's Department"]
[{"$f":"IF(TITLE=\"> Enter workbook title here\",\"Enter workbook title in Cover sheet\",TITLE)","v":"Local Government Pension Scheme (LGPS) - Consolidated Factor Spreadsheet"}]
["Added pension - x-704"]
[]
[]
["Data Item","Factor Table Information"]
["Scheme","LGPS_EW"]
["Section","pre 2012"]
["Factor Type","Added pension"]
["Description","Additional own and dependant's pension - regular monthly contributions - Females (purchase of additional pension prior to April 2012) - (monthly payment (£) to purchase £250 additional pension)"]
["Gender","Female"]
["Factor Age/Period Definition","Age at first contribution"]
["Section Number",0]
["Series Number",704]
["Table Reference","0-704"]
["Table Reference in Guidance","Table D"]
["Related Factor Guidance Note","LGPS EW Purchase of additional pension - Elections before 1 April 2012. 5 May 2021"]
["Date Factors Issued to Client","2023-09-26"]
["Date Factors Implemented (if known)","2023-10-02"]
["Factor Status","Issued"]
[]
[null,{"$f":"HYPERLINK(\"#'Factor List'!A1\",\"Back to Factor List\")","v":"Back to Factor List"}]
[]
[]
["Age","Contract length (years) 1","Contract length (years) 2","Contract length (years) 3","Contract length (years) 4","Contract length (years) 5","Contract length (years) 6","Contract length (years) 7","Contract length (years) 8","Contract length (years) 9","Contract length (years) 10","Contract length (years) 11","Contract length (years) 12","Contract length (years) 13","Contract length (years) 14","Contract length (years) 15","Contract length (years) 16","Contract length (years) 17","Contract length (years) 18","Contract length (years) 19","Contract length (years) 20","Contract length (years) 21","Contract length (years) 22","Contract length (years) 23","Contract length (years) 24","Contract length (years) 25","Contract length (years) 26","Contract length (years) 27","Contract length (years) 28","Contract length (years) 29","Contract length (years) 30","Contract length (years) 31","Contract length (years) 32","Contract length (years) 33","Contract length (years) 34","Contract length (years) 35","Contract length (years) 36","Contract length (years) 37","Contract length (years) 38","Contract length (years) 39","Contract length (years) 40","Contract length (years) 41","Contract length (years) 42","Contract length (years) 43","Contract length (years) 44","Contract length (years) 45","Contract length (years) 46","Contract length (years) 47","Contract length (years) 48"]
[16,null,null,null,null,null,null,null,null,null,null,null,23.93,22.47,21.22,20.14,19.2,18.37,17.64,16.98,16.399999999999999,15.87,15.4,14.96,14.57,14.21,13.88,13.57,13.29,13.03,12.79,12.57,12.36,12.16,11.98,11.81,11.66,11.51,11.37,11.24,11.12,11,10.9,10.79,10.7,10.61,10.53,10.45,10.37]
[17,null,null,null,null,null,null,null,null,null,null,null,24.26,22.78,21.51,20.420000000000002,19.46,18.62,17.88,17.22,16.63,16.09,15.61,15.17,14.77,14.41,14.07,13.76,13.48,13.21,12.97,12.74,12.53,12.34,12.15,11.98,11.82,11.67,11.53,11.4,11.28,11.16,11.05,10.95,10.86,10.77,10.68,10.6]
[18,null,null,null,null,null,null,null,null,null,null,null,24.6,23.09,21.81,20.7,19.73,18.88,18.13,17.46,16.86,16.32,15.83,15.38,14.98,14.61,14.27,13.95,13.66,13.4,13.15,12.92,12.71,12.51,12.32,12.15,11.99,11.84,11.7,11.56,11.44,11.32,11.21,11.11,11.02,10.93,10.84]
[19,null,null,null,null,null,null,null,null,null,null,null,24.94,23.41,22.11,20.99,20.010000000000002,19.14,18.38,17.7,17.09,16.54,16.05,15.6,15.19,14.81,14.47,14.15,13.86,13.59,13.34,13.1,12.89,12.69,12.5,12.32,12.16,12.01,11.86,11.73,11.61,11.49,11.38,11.27,11.18,11.09]
[20,null,null,null,null,null,null,null,null,null,null,null,25.28,23.74,22.42,21.28,20.28,19.41,18.63,17.95,17.329999999999998,16.77,16.27,15.81,15.4,15.02,14.67,14.35,14.05,13.78,13.52,13.29,13.07,12.87,12.68,12.5,12.33,12.18,12.04,11.9,11.77,11.66,11.55,11.44,11.35]
[21,null,null,null,null,null,null,null,null,null,null,null,25.63,24.06,22.73,21.57,20.56,19.68,18.89,18.190000000000001,17.57,17.010000000000002,16.5,16.03,15.61,15.23,14.87,14.55,14.25,13.97,13.71,13.48,13.25,13.05,12.86,12.68,12.51,12.36,12.21,12.07,11.95,11.83,11.72,11.61]
[22,null,null,null,null,null,null,null,null,null,null,null,25.98,24.4,23.04,21.87,20.85,19.95,19.149999999999999,18.45,17.809999999999999,17.239999999999998,16.73,16.260000000000002,15.83,15.44,15.08,14.75,14.45,14.17,13.91,13.67,13.44,13.24,13.04,12.86,12.69,12.54,12.39,12.25,12.12,12.01,11.89]
[23,null,null,null,null,null,null,null,null,null,null,null,26.34,24.73,23.36,22.17,21.14,20.23,19.420000000000002,18.7,18.059999999999999,17.48,16.96,16.48,16.05,15.66,15.29,14.96,14.65,14.37,14.11,13.86,13.64,13.43,13.23,13.05,12.88,12.72,12.57,12.43,12.31,12.19]
[24,null,null,null,null,null,null,null,null,null,null,null,26.7,25.07,23.68,22.48,21.43,20.51,19.690000000000001,18.96,18.309999999999999,17.73,17.2,16.71,16.28,15.88,15.51,15.17,14.86,14.57,14.31,14.06,13.83,13.62,13.42,13.24,13.07,12.91,12.76,12.62,12.49]
[25,null,null,null,null,null,null,null,null,null,null,null,27.07,25.42,24.01,22.79,21.72,20.79,19.96,19.23,18.57,17.97,17.440000000000001,16.95,16.5,16.100000000000001,15.73,15.39,15.07,14.78,14.51,14.26,14.03,13.82,13.62,13.43,13.26,13.1,12.95,12.81]
[26,null,null,null,null,null,null,null,null,null,null,null,27.44,25.77,24.34,23.1,22.03,21.08,20.239999999999998,19.489999999999998,18.829999999999998,18.22,17.68,17.190000000000001,16.739999999999998,16.329999999999998,15.95,15.6,15.29,14.99,14.72,14.47,14.24,14.02,13.82,13.63,13.46,13.3,13.15]
[27,null,null,null,null,null,null,null,null,null,null,null,27.82,26.13,24.68,23.42,22.33,21.37,20.52,19.77,19.09,18.48,17.93,17.43,16.97,16.559999999999999,16.18,15.83,15.51,15.21,14.93,14.68,14.44,14.23,14.02,13.84,13.66,13.5]
[28,null,null,null,null,null,null,null,null,null,null,null,28.21,26.49,25.02,23.75,22.64,21.67,20.81,20.04,19.36,18.739999999999998,18.18,17.670000000000002,17.21,16.79,16.41,16.05,15.73,15.43,15.15,14.9,14.66,14.44,14.24,14.05,13.87]
[29,null,null,null,null,null,null,null,null,null,null,null,28.59,26.85,25.36,24.08,22.95,21.97,21.1,20.32,19.63,19,18.440000000000001,17.93,17.46,17.03,16.64,16.29,15.96,15.65,15.37,15.12,14.88,14.66,14.45,14.26]
[30,null,null,null,null,null,null,null,null,null,null,null,28.99,27.22,25.71,24.41,23.27,22.28,21.39,20.61,19.899999999999999,19.27,18.7,18.18,17.71,17.28,16.88,16.52,16.190000000000001,15.88,15.6,15.34,15.1,14.88,14.67]
[31,null,null,null,null,null,null,null,null,null,null,null,29.39,27.6,26.07,24.75,23.6,22.59,21.69,20.9,20.18,19.54,18.96,18.440000000000001,17.96,17.53,17.13,16.760000000000002,16.43,16.12,15.84,15.57,15.33,15.11]
[32,null,null,null,null,null,null,null,null,null,null,null,29.79,27.98,26.43,25.09,23.93,22.9,22,21.19,20.47,19.82,19.239999999999998,18.71,18.22,17.78,17.38,17.010000000000002,16.670000000000002,16.36,16.079999999999998,15.81,15.57]
[33,null,null,null,null,null,null,null,null,null,null,null,30.21,28.37,26.8,25.44,24.26,23.22,22.31,21.49,20.76,20.11,19.510000000000002,18.98,18.489999999999998,18.04,17.64,17.27,16.93,16.61,16.32,16.059999999999999]
[34,null,null,null,null,null,null,null,null,null,null,null,30.62,28.76,27.17,25.8,24.6,23.55,22.62,21.8,21.06,20.39,19.8,19.25,18.760000000000002,18.309999999999999,17.899999999999999,17.53,17.18,16.87,16.579999999999998]
[35,null,null,null,null,null,null,null,null,null,null,null,31.05,29.16,27.55,26.16,24.95,23.89,22.95,22.11,21.36,20.69,20.09,19.54,19.04,18.59,18.170000000000002,17.8,17.45,17.13]
[36,null,null,null,null,null,null,null,null,null,null,null,31.48,29.57,27.94,26.53,25.3,24.23,23.27,22.43,21.67,20.99,20.38,19.829999999999998,19.329999999999998,18.87,18.45,18.07,17.73]
[37,null,null,null,null,null,null,null,null,null,null,null,31.92,29.98,28.33,26.9,25.66,24.57,23.61,22.75,21.99,21.3,20.69,20.13,19.62,19.16,18.739999999999998,18.36]
[38,null,null,null,null,null,null,null,null,null,null,null,32.36,30.4,28.73,27.28,26.03,24.93,23.95,23.09,22.31,21.62,21,20.43,19.920000000000002,19.46,19.04]
[39,null,null,null,null,null,null,null,null,null,null,null,32.82,30.83,29.14,27.67,26.4,25.29,24.3,23.43,22.65,21.95,21.32,20.75,20.239999999999998,19.77]
[40,null,null,null,null,null,null,null,null,null,null,null,33.28,31.27,29.55,28.07,26.79,25.66,24.66,23.78,22.99,22.29,21.65,21.08,20.56]
[41,null,null,null,null,null,null,null,null,null,null,null,33.75,31.71,29.98,28.48,27.18,26.04,25.03,24.14,23.35,22.63,21.99,21.42]
[42,null,null,null,null,null,null,null,null,null,null,null,34.229999999999997,32.17,30.41,28.9,27.58,26.43,25.41,24.51,23.71,22.99,22.35]
[43,null,null,null,null,null,null,null,null,null,null,null,34.72,32.64,30.86,29.33,28,26.83,25.81,24.9,24.09,23.37]
[44,null,null,null,null,null,null,null,null,null,null,null,35.229999999999997,33.119999999999997,31.32,29.77,28.43,27.25,26.22,25.3,24.49]
[45,null,null,null,null,null,null,null,null,null,null,null,35.74,33.61,31.79,30.23,28.87,27.68,26.64,25.72]
[46,null,null,null,null,null,null,null,null,null,null,null,36.270000000000003,34.11,32.28,30.7,29.33,28.13,27.08]
[47,null,null,null,null,null,null,null,null,null,null,null,36.82,34.64,32.78,31.19,29.8,28.6]
[48,null,null,null,null,null,null,null,null,null,null,null,37.380000000000003,35.18,33.299999999999997,31.69,30.3]
[49,null,null,null,null,null,null,null,null,null,null,null,37.97,35.74,33.85,32.229999999999997]
[50,null,null,null,null,null,null,null,null,null,null,null,38.58,36.33,34.42]
[51,null,null,null,null,null,null,null,null,null,null,null,39.21,36.94]
[52,null,null,null,null,null,null,null,null,null,null,null,39.869999999999997]
[53]
[54]
[55]
[56]
[57]
[58]
[59]
[60]
[61]
[62]
[63]

{"sheet":"x-705","index":57,"n_rows":73,"n_cols":49,"rows_kept":73,"cut":false,"hidden":false,"merged":[]}
["Government Actuary's Department"]
[{"$f":"IF(TITLE=\"> Enter workbook title here\",\"Enter workbook title in Cover sheet\",TITLE)","v":"Local Government Pension Scheme (LGPS) - Consolidated Factor Spreadsheet"}]
["Added pension - x-705"]
[]
[]
["Data Item","Factor Table Information"]
["Scheme","LGPS_EW"]
["Section","2012-2014"]
["Factor Type","Added pension"]
["Description","Additional own pension - regular monthly contributions - Males (elections between April 2012 and March 2014) - (monthly payment (£) to purchase £250 additional pension)"]
["Gender","Male"]
["Factor Age/Period Definition","Age at first contribution"]
["Section Number",0]
["Series Number",705]
["Table Reference","0-705"]
["Table Reference in Guidance","Table C"]
["Related Factor Guidance Note","LGPS EW Purchase of additional pension for elections  April 2012 to March 2014. 5 May 2021"]
["Date Factors Issued to Client","2023-09-26"]
["Date Factors Implemented (if known)","2023-10-02"]
["Factor Status","Issued"]
[]
[null,{"$f":"HYPERLINK(\"#'Factor List'!A1\",\"Back to Factor List\")","v":"Back to Factor List"}]
[]
[]
["Age","Contract length (years) 1","Contract length (years) 2","Contract length (years) 3","Contract length (years) 4","Contract length (years) 5","Contract length (years) 6","Contract length (years) 7","Contract length (years) 8","Contract length (years) 9","Contract length (years) 10","Contract length (years) 11","Contract length (years) 12","Contract length (years) 13","Contract length (years) 14","Contract length (years) 15","Contract length (years) 16","Contract length (years) 17","Contract length (years) 18","Contract length (years) 19","Contract length (years) 20","Contract length (years) 21","Contract length (years) 22","Contract length (years) 23","Contract length (years) 24","Contract length (years) 25","Contract length (years) 26","Contract length (years) 27","Contract length (years) 28","Contract length (years) 29","Contract length (years) 30","Contract length (years) 31","Contract length (years) 32","Contract length (years) 33","Contract length (years) 34","Contract length (years) 35","Contract length (years) 36","Contract length (years) 37","Contract length (years) 38","Contract length (years) 39","Contract length (years) 40","Contract length (years) 41","Contract length (years) 42","Contract length (years) 43","Contract length (years) 44","Contract length (years) 45","Contract length (years) 46","Contract length (years) 47","Contract length (years) 48"]
[16,null,null,null,null,null,null,null,null,null,21.58,19.96,18.62,17.48,16.510000000000002,15.67,14.94,14.3,13.73,13.22,12.77,12.36,11.99,11.65,11.35,11.07,10.81,10.57,10.35,10.15,9.9700000000000006,9.7899999999999991,9.6300000000000008,9.48,9.34,9.2100000000000009,9.09,8.98,8.8699999999999992,8.77,8.68,8.59,8.51,8.43,8.36,8.2899999999999991,8.23,8.17,8.11]
[17,null,null,null,null,null,null,null,null,null,21.9,20.260000000000002,18.89,17.739999999999998,16.75,15.9,15.16,14.51,13.93,13.41,12.95,12.54,12.16,11.82,11.51,11.23,10.97,10.73,10.51,10.3,10.119999999999999,9.94,9.7799999999999994,9.6300000000000008,9.48,9.35,9.23,9.11,9.01,8.9,8.81,8.7200000000000006,8.64,8.56,8.49,8.42,8.36,8.3000000000000007]
[18,null,null,null,null,null,null,null,null,null,22.22,20.55,19.16,18,17,16.13,15.38,14.72,14.13,13.61,13.14,12.72,12.34,12,11.68,11.4,11.13,10.89,10.66,10.46,10.27,10.09,9.92,9.77,9.6300000000000008,9.49,9.3699999999999992,9.25,9.14,9.0399999999999991,8.9499999999999993,8.86,8.77,8.6999999999999993,8.6199999999999992,8.5500000000000007,8.49]
[19,null,null,null,null,null,null,null,null,null,22.54,20.85,19.440000000000001,18.260000000000002,17.239999999999998,16.37,15.61,14.93,14.34,13.81,13.34,12.91,12.53,12.18,11.86,11.56,11.3,11.05,10.82,10.61,10.42,10.24,10.07,9.92,9.77,9.64,9.51,9.39,9.2799999999999994,9.18,9.09,9,8.91,8.83,8.76,8.69]
[20,null,null,null,null,null,null,null,null,null,22.87,21.15,19.73,18.53,17.5,16.61,15.83,15.15,14.55,14.01,13.53,13.1,12.71,12.36,12.03,11.74,11.46,11.22,10.99,10.77,10.58,10.39,10.23,10.07,9.92,9.7899999999999991,9.66,9.5399999999999991,9.43,9.32,9.23,9.14,9.0500000000000007,8.9700000000000006,8.9]
[21,null,null,null,null,null,null,null,null,null,23.2,21.46,20.02,18.8,17.75,16.850000000000001,16.07,15.38,14.77,14.22,13.73,13.3,12.9,12.54,12.21,11.91,11.64,11.38,11.15,10.93,10.74,10.55,10.38,10.220000000000001,10.07,9.94,9.81,9.69,9.58,9.4700000000000006,9.3699999999999992,9.2799999999999994,9.1999999999999993,9.1199999999999992]
[22,null,null,null,null,null,null,null,null,null,23.54,21.78,20.309999999999999,19.07,18.010000000000002,17.100000000000001,16.3,15.6,14.98,14.43,13.94,13.49,13.09,12.72,12.39,12.09,11.81,11.55,11.32,11.1,10.9,10.71,10.54,10.38,10.23,10.09,9.9600000000000009,9.84,9.73,9.6199999999999992,9.52,9.43,9.35]
[23,null,null,null,null,null,null,null,null,null,23.89,22.09,20.61,19.350000000000001,18.28,17.350000000000001,16.54,15.83,15.2,14.64,14.14,13.69,13.28,12.91,12.58,12.27,11.99,11.73,11.49,11.27,11.06,10.88,10.7,10.54,10.39,10.25,10.119999999999999,9.99,9.8800000000000008,9.7799999999999994,9.68,9.59]
[24,null,null,null,null,null,null,null,null,null,24.23,22.42,20.91,19.63,18.54,17.600000000000001,16.78,16.059999999999999,15.43,14.86,14.35,13.89,13.48,13.11,12.76,12.45,12.17,11.9,11.66,11.44,11.23,11.04,10.87,10.7,10.55,10.41,10.28,10.15,10.039999999999999,9.93,9.84]
[25,null,null,null,null,null,null,null,null,null,24.59,22.74,21.21,19.920000000000002,18.82,17.86,17.03,16.3,15.66,15.08,14.56,14.1,13.68,13.3,12.96,12.64,12.35,12.08,11.84,11.61,11.41,11.21,11.03,10.87,10.72,10.57,10.44,10.32,10.199999999999999,10.1]
[26,null,null,null,null,null,null,null,null,null,24.95,23.08,21.52,20.21,19.09,18.13,17.28,16.54,15.89,15.3,14.78,14.31,13.89,13.5,13.15,12.83,12.54,12.27,12.02,11.79,11.58,11.39,11.21,11.04,10.89,10.74,10.61,10.49,10.37]
[27,null,null,null,null,null,null,null,null,null,25.31,23.41,21.84,20.51,19.37,18.39,17.54,16.79,16.12,15.53,15,14.53,14.1,13.71,13.35,13.03,12.73,12.46,12.21,11.98,11.76,11.57,11.39,11.22,11.06,10.92,10.78,10.66]
[28,null,null,null,null,null,null,null,null,null,25.68,23.76,22.16,20.81,19.66,18.66,17.8,17.04,16.36,15.76,15.23,14.74,14.31,13.91,13.55,13.23,12.93,12.65,12.4,12.16,11.95,11.75,11.57,11.4,11.24,11.1,10.96]
[29,null,null,null,null,null,null,null,null,null,26.05,24.1,22.48,21.12,19.95,18.940000000000001,18.059999999999999,17.29,16.61,16,15.46,14.97,14.52,14.12,13.76,13.43,13.13,12.85,12.59,12.36,12.14,11.94,11.76,11.58,11.43,11.28]
[30,null,null,null,null,null,null,null,null,null,26.44,24.46,22.81,21.43,20.239999999999998,19.22,18.329999999999998,17.55,16.86,16.239999999999998,15.69,15.19,14.75,14.34,13.97,13.64,13.33,13.05,12.79,12.55,12.33,12.13,11.95,11.78,11.62]
[31,null,null,null,null,null,null,null,null,null,26.82,24.82,23.15,21.74,20.54,19.510000000000002,18.600000000000001,17.809999999999999,17.11,16.48,15.93,15.43,14.97,14.56,14.19,13.85,13.54,13.26,13,12.76,12.54,12.33,12.15,11.98]
[32,null,null,null,null,null,null,null,null,null,27.22,25.18,23.49,22.07,20.85,19.8,18.88,18.079999999999998,17.37,16.739999999999998,16.170000000000002,15.66,15.2,14.79,14.41,14.07,13.76,13.47,13.21,12.97,12.74,12.54,12.35]
[33,null,null,null,null,null,null,null,null,null,27.62,25.55,23.84,22.39,21.16,20.09,19.170000000000002,18.350000000000001,17.63,16.989999999999998,16.420000000000002,15.9,15.44,15.02,14.64,14.29,13.98,13.69,13.42,13.18,12.96,12.75]
[34,null,null,null,null,null,null,null,null,null,28.02,25.93,24.19,22.73,21.48,20.399999999999999,19.45,18.63,17.899999999999999,17.25,16.670000000000002,16.149999999999999,15.68,15.26,14.87,14.52,14.21,13.91,13.65,13.4,13.18]
[35,null,null,null,null,null,null,null,null,null,28.44,26.32,24.55,23.07,21.8,20.7,19.75,18.91,18.18,17.52,16.93,16.41,15.93,15.5,15.12,14.76,14.44,14.15,13.88,13.64]
[36,null,null,null,null,null,null,null,null,null,28.86,26.71,24.92,23.41,22.13,21.02,20.05,19.21,18.46,17.79,17.2,16.670000000000002,16.190000000000001,15.76,15.36,15.01,14.69,14.39,14.12]
[37,null,null,null,null,null,null,null,null,null,29.29,27.11,25.29,23.77,22.46,21.34,20.36,19.5,18.75,18.079999999999998,17.48,16.940000000000001,16.45,16.02,15.62,15.26,14.94,14.64]
[38,null,null,null,null,null,null,null,null,null,29.72,27.51,25.68,24.13,22.81,21.67,20.68,19.809999999999999,19.04,18.36,17.760000000000002,17.21,16.73,16.29,15.89,15.53,15.2]
[39,null,null,null,null,null,null,null,null,null,30.17,27.93,26.07,24.5,23.16,22.01,21,20.12,19.350000000000001,18.66,18.05,17.5,17.010000000000002,16.57,16.16,15.8]
[40,null,null,null,null,null,null,null,null,null,30.62,28.35,26.46,24.87,23.52,22.35,21.34,20.45,19.66,18.97,18.350000000000001,17.8,17.3,16.850000000000001,16.45]
[41,null,null,null,null,null,null,null,null,null,31.09,28.78,26.87,25.26,23.89,22.71,21.68,20.78,19.989999999999998,19.29,18.66,18.11,17.61,17.16]
[42,null,null,null,null,null,null,null,null,null,31.56,29.23,27.29,25.66,24.27,23.07,22.04,21.13,20.329999999999998,19.62,18.989999999999998,18.43,17.920000000000002]
[43,null,null,null,null,null,null,null,null,null,32.049999999999997,29.68,27.72,26.07,24.66,23.45,22.4,21.48,20.68,19.96,19.329999999999998,18.760000000000002]
[44,null,null,null,null,null,null,null,null,null,32.549999999999997,30.15,28.16,26.49,25.07,23.84,22.78,21.85,21.04,20.32,19.68]
[45,null,null,null,null,null,null,null,null,null,33.06,30.63,28.62,26.93,25.49,24.25,23.18,22.24,21.42,20.69]
[46,null,null,null,null,null,null,null,null,null,33.590000000000003,31.13,29.09,27.38,25.92,24.67,23.59,22.64,21.81]
[47,null,null,null,null,null,null,null,null,null,34.130000000000003,31.64,29.58,27.84,26.37,25.11,24.01,23.06]
[48,null,null,null,null,null,null,null,null,null,34.69,32.17,30.08,28.33,26.84,25.57,24.47,0]
[49,null,null,null,null,null,null,null,null,null,35.270000000000003,32.72,30.61,28.84,27.34,26.05]
[50,null,null,null,null,null,null,null,null,null,35.880000000000003,33.299999999999997,31.16,29.37,27.86]
[51,null,null,null,null,null,null,null,null,null,36.51,33.9,31.74,29.93]
[52,null,null,null,null,null,null,null,null,null,37.17,34.53,32.35]
[53,null,null,null,null,null,null,null,null,null,37.869999999999997,35.200000000000003]
[54,null,null,null,null,null,null,null,null,null,38.61]
[55]
[56]
[57]
[58]
[59]
[60]
[61]
[62]
[63]

{"sheet":"x-706","index":58,"n_rows":73,"n_cols":49,"rows_kept":73,"cut":false,"hidden":false,"merged":[]}
["Government Actuary's Department"]
[{"$f":"IF(TITLE=\"> Enter workbook title here\",\"Enter workbook title in Cover sheet\",TITLE)","v":"Local Government Pension Scheme (LGPS) - Consolidated Factor Spreadsheet"}]
["Added pension - x-706"]
[]
[]
["Data Item","Factor Table Information"]
["Scheme","LGPS_EW"]
["Section","2012-2014"]
["Factor Type","Added pension"]
["Description","Additional own pension - regular monthly contributions - Females (elections between April 2012 and March 2014) - (monthly payment (£) to purchase £250 additional pension)"]
["Gender","Female"]
["Factor Age/Period Definition","Age at first contribution"]
["Section Number",0]
["Series Number",706]
["Table Reference","0-706"]
["Table Reference in Guidance","Table D"]
["Related Factor Guidance Note","LGPS EW Purchase of additional pension for elections  April 2012 to March 2014. 5 May 2021"]
["Date Factors Issued to Client","2023-09-26"]
["Date Factors Implemented (if known)","2023-10-02"]
["Factor Status","Issued"]
[]
[null,{"$f":"HYPERLINK(\"#'Factor List'!A1\",\"Back to Factor List\")","v":"Back to Factor List"}]
[]
[]
["Age","Contract length (years) 1","Contract length (years) 2","Contract length (years) 3","Contract length (years) 4","Contract length (years) 5","Contract length (years) 6","Contract length (years) 7","Contract length (years) 8","Contract length (years) 9","Contract length (years) 10","Contract length (years) 11","Contract length (years) 12","Contract length (years) 13","Contract length (years) 14","Contract length (years) 15","Contract length (years) 16","Contract length (years) 17","Contract length (years) 18","Contract length (years) 19","Contract length (years) 20","Contract length (years) 21","Contract length (years) 22","Contract length (years) 23","Contract length (years) 24","Contract length (years) 25","Contract length (years) 26","Contract length (years) 27","Contract length (years) 28","Contract length (years) 29","Contract length (years) 30","Contract length (years) 31","Contract length (years) 32","Contract length (years) 33","Contract length (years) 34","Contract length (years) 35","Contract length (years) 36","Contract length (years) 37","Contract length (years) 38","Contract length (years) 39","Contract length (years) 40","Contract length (years) 41","Contract length (years) 42","Contract length (years) 43","Contract length (years) 44","Contract length (years) 45","Contract length (years) 46","Contract length (years) 47","Contract length (years) 48"]
[16,null,null,null,null,null,null,null,null,null,23.4,21.64,20.18,18.940000000000001,17.89,16.98,16.190000000000001,15.49,14.87,14.32,13.83,13.38,12.98,12.62,12.28,11.98,11.7,11.44,11.21,10.99,10.78,10.59,10.42,10.26,10.1,9.9600000000000009,9.83,9.6999999999999993,9.59,9.48,9.3699999999999992,9.2799999999999994,9.19,9.1,9.02,8.9499999999999993,8.8800000000000008,8.81,8.75]
[17,null,null,null,null,null,null,null,null,null,23.74,21.96,20.48,19.23,18.16,17.23,16.43,15.72,15.09,14.53,14.03,13.58,13.17,12.8,12.47,12.16,11.87,11.61,11.37,11.15,10.95,10.75,10.58,10.41,10.26,10.11,9.98,9.85,9.73,9.6199999999999992,9.52,9.42,9.33,9.24,9.16,9.09,9.02,8.9499999999999993]
[18,null,null,null,null,null,null,null,null,null,24.1,22.29,20.78,19.510000000000002,18.43,17.489999999999998,16.670000000000002,15.95,15.32,14.75,14.24,13.79,13.37,13,12.65,12.34,12.05,11.79,11.55,11.32,11.11,10.92,10.74,10.57,10.41,10.27,10.130000000000001,10,9.8800000000000008,9.77,9.67,9.57,9.4700000000000006,9.39,9.31,9.23,9.16]
[19,null,null,null,null,null,null,null,null,null,24.45,22.62,21.09,19.8,18.7,17.75,16.920000000000002,16.190000000000001,15.55,14.97,14.46,13.99,13.57,13.19,12.84,12.53,12.23,11.97,11.72,11.49,11.28,11.08,10.9,10.73,10.57,10.42,10.29,10.16,10.039999999999999,9.92,9.82,9.7200000000000006,9.6199999999999992,9.5399999999999991,9.4499999999999993,9.3800000000000008]
[20,null,null,null,null,null,null,null,null,null,24.82,22.95,21.4,20.100000000000001,18.98,18.010000000000002,17.170000000000002,16.43,15.78,15.19,14.67,14.2,13.77,13.39,13.04,12.71,12.42,12.15,11.9,11.66,11.45,11.25,11.07,10.89,10.73,10.58,10.44,10.31,10.19,10.08,9.9700000000000006,9.8699999999999992,9.7799999999999994,9.69,9.61]
[21,null,null,null,null,null,null,null,null,null,25.19,23.29,21.72,20.39,19.260000000000002,18.28,17.43,16.68,16.010000000000002,15.42,14.89,14.41,13.98,13.59,13.23,12.9,12.61,12.33,12.08,11.84,11.62,11.42,11.23,11.06,10.9,10.75,10.6,10.47,10.35,10.23,10.130000000000001,10.029999999999999,9.93,9.84]
[22,null,null,null,null,null,null,null,null,null,25.56,23.64,22.04,20.7,19.55,18.55,17.690000000000001,16.93,16.25,15.65,15.11,14.63,14.19,13.79,13.43,13.1,12.8,12.52,12.26,12.02,11.8,11.6,11.41,11.23,11.07,10.91,10.77,10.64,10.51,10.4,10.29,10.19,10.09]
[23,null,null,null,null,null,null,null,null,null,25.94,23.99,22.37,21.01,19.84,18.829999999999998,17.95,17.18,16.489999999999998,15.89,15.34,14.85,14.4,14,13.63,13.3,12.99,12.71,12.44,12.2,11.98,11.77,11.58,11.4,11.24,11.08,10.94,10.8,10.68,10.56,10.45,10.35]
[24,null,null,null,null,null,null,null,null,null,26.32,24.35,22.7,21.32,20.13,19.11,18.22,17.43,16.739999999999998,16.12,15.57,15.07,14.62,14.21,13.84,13.5,13.19,12.9,12.63,12.39,12.16,11.95,11.76,11.58,11.41,11.26,11.11,10.97,10.85,10.73,10.62]
[25,null,null,null,null,null,null,null,null,null,26.71,24.71,23.04,21.63,20.43,19.399999999999999,18.489999999999998,17.7,16.989999999999998,16.36,15.8,15.3,14.84,14.43,14.05,13.7,13.39,13.1,12.83,12.58,12.35,12.14,11.94,11.76,11.59,11.43,11.29,11.15,11.02,10.9]
[26,null,null,null,null,null,null,null,null,null,27.11,25.07,23.38,21.96,20.74,19.68,18.77,17.96,17.25,16.61,16.04,15.53,15.06,14.64,14.26,13.91,13.59,13.3,13.02,12.77,12.54,12.33,12.13,11.95,11.77,11.62,11.47,11.33,11.2]
[27,null,null,null,null,null,null,null,null,null,27.51,25.45,23.73,22.28,21.05,19.98,19.05,18.23,17.5,16.86,16.28,15.76,15.29,14.87,14.48,14.12,13.8,13.5,13.22,12.97,12.74,12.52,12.32,12.13,11.96,11.8,11.65,11.52]
[28,null,null,null,null,null,null,null,null,null,27.92,25.82,24.08,22.62,21.36,20.28,19.329999999999998,18.5,17.77,17.11,16.53,16,15.52,15.09,14.7,14.34,14.01,13.71,13.43,13.17,12.94,12.72,12.52,12.33,12.15,11.99,11.84]
[29,null,null,null,null,null,null,null,null,null,28.33,26.21,24.44,22.95,21.68,20.58,19.62,18.78,18.03,17.37,16.78,16.239999999999998,15.76,15.32,14.92,14.56,14.23,13.92,13.64,13.38,13.14,12.92,12.72,12.53,12.35,12.19]
[30,null,null,null,null,null,null,null,null,null,28.75,26.6,24.81,23.29,22,20.89,19.920000000000002,19.059999999999999,18.309999999999999,17.63,17.03,16.489999999999998,16,15.56,15.15,14.79,14.45,14.14,13.85,13.59,13.35,13.13,12.92,12.73,12.56]
[31,null,null,null,null,null,null,null,null,null,29.18,26.99,25.18,23.64,22.33,21.2,20.22,19.350000000000001,18.579999999999998,17.899999999999999,17.29,16.739999999999998,16.25,15.8,15.39,15.02,14.67,14.36,14.07,13.81,13.57,13.34,13.14,12.94]
[32,null,null,null,null,null,null,null,null,null,29.62,27.4,25.55,24,22.67,21.52,20.52,19.64,18.87,18.170000000000002,17.559999999999999,17,16.5,16.04,15.63,15.25,14.91,14.59,14.3,14.03,13.79,13.56,13.35]
[33,null,null,null,null,null,null,null,null,null,30.06,27.8,25.93,24.36,23.01,21.84,20.83,19.940000000000001,19.149999999999999,18.45,17.829999999999998,17.260000000000002,16.75,16.29,15.87,15.49,15.14,14.82,14.53,14.26,14.02,13.79]
[34,null,null,null,null,null,null,null,null,null,30.5,28.22,26.32,24.72,23.35,22.17,21.15,20.239999999999998,19.45,18.739999999999998,18.100000000000001,17.53,17.02,16.55,16.13,15.74,15.39,15.07,14.77,14.5,14.25]
[35,null,null,null,null,null,null,null,null,null,30.96,28.64,26.72,25.09,23.71,22.51,21.47,20.55,19.739999999999998,19.03,18.38,17.8,17.28,16.809999999999999,16.38,15.99,15.64,15.31,15.02,14.74]
[36,null,null,null,null,null,null,null,null,null,31.42,29.07,27.12,25.47,24.07,22.85,21.8,20.87,20.05,19.32,18.670000000000002,18.09,17.559999999999999,17.079999999999998,16.649999999999999,16.260000000000002,15.9,15.57,15.27]
[37,null,null,null,null,null,null,null,null,null,31.89,29.51,27.53,25.86,24.43,23.2,22.13,21.19,20.36,19.63,18.97,18.37,17.84,17.36,16.920000000000002,16.53,16.16,15.84]
[38,null,null,null,null,null,null,null,null,null,32.369999999999997,29.95,27.95,26.25,24.81,23.56,22.48,21.52,20.68,19.940000000000001,19.27,18.670000000000002,18.13,17.649999999999999,17.2,16.8,16.440000000000001]
[39,null,null,null,null,null,null,null,null,null,32.86,30.41,28.37,26.65,25.19,23.93,22.83,21.86,21.01,20.260000000000002,19.579999999999998,18.98,18.43,17.940000000000001,17.5,17.09]
[40,null,null,null,null,null,null,null,null,null,33.36,30.87,28.81,27.07,25.58,24.3,23.19,22.21,21.35,20.58,19.899999999999999,19.29,18.739999999999998,18.25,17.8]
[41,null,null,null,null,null,null,null,null,null,33.86,31.34,29.25,27.48,25.98,24.68,23.56,22.57,21.7,20.92,20.23,19.62,19.059999999999999,18.559999999999999]
[42,null,null,null,null,null,null,null,null,null,34.380000000000003,31.82,29.7,27.91,26.39,25.08,23.93,22.93,22.05,21.27,20.58,19.95,19.399999999999999]
[43,null,null,null,null,null,null,null,null,null,34.909999999999997,32.32,30.17,28.36,26.81,25.48,24.33,23.31,22.42,21.63,20.93,20.3]
[44,null,null,null,null,null,null,null,null,null,35.450000000000003,32.82,30.64,28.81,27.24,25.9,24.73,23.71,22.81,22.01,21.3]
[45,null,null,null,null,null,null,null,null,null,36,33.340000000000003,31.13,29.27,27.69,26.33,25.15,24.11,23.2,22.4]
[46,null,null,null,null,null,null,null,null,null,36.57,33.869999999999997,31.64,29.75,28.15,26.77,25.58,24.53,23.62]
[47,null,null,null,null,null,null,null,null,null,37.159999999999997,34.42,32.159999999999997,30.25,28.63,27.24,26.03,24.98]
[48,null,null,null,null,null,null,null,null,null,37.76,34.99,32.69,30.77,29.13,27.72,26.5]
[49,null,null,null,null,null,null,null,null,null,38.380000000000003,35.57,33.25,31.3,29.64,28.22]
[50,null,null,null,null,null,null,null,null,null,39.020000000000003,36.18,33.83,31.86,30.18]
[51,null,null,null,null,null,null,null,null,null,39.69,36.82,34.44,32.44]
[52,null,null,null,null,null,null,null,null,null,40.39,37.479999999999997,35.07]
[53,null,null,null,null,null,null,null,null,null,41.11,38.17]
[54,null,null,null,null,null,null,null,null,null,41.88]
[55]
[56]
[57]
[58]
[59]
[60]
[61]
[62]
[63]

{"sheet":"x-707","index":59,"n_rows":73,"n_cols":49,"rows_kept":73,"cut":false,"hidden":false,"merged":[]}
["Government Actuary's Department"]
[{"$f":"IF(TITLE=\"> Enter workbook title here\",\"Enter workbook title in Cover sheet\",TITLE)","v":"Local Government Pension Scheme (LGPS) - Consolidated Factor Spreadsheet"}]
["Added pension - x-707"]
[]
[]
["Data Item","Factor Table Information"]
["Scheme","LGPS_EW"]
["Section","2012-2014"]
["Factor Type","Added pension"]
["Description","Additional own and dependant's pension - regular monthly contributions - Males (elections between April 2012 and March 2014) - (monthly payment (£) to purchase £250 additional pension)"]
["Gender","Male"]
["Factor Age/Period Definition","Age at first contribution"]
["Section Number",0]
["Series Number",707]
["Table Reference","0-707"]
["Table Reference in Guidance","Table E"]
["Related Factor Guidance Note","LGPS EW Purchase of additional pension for elections  April 2012 to March 2014. 5 May 2021"]
["Date Factors Issued to Client","2023-09-26"]
["Date Factors Implemented (if known)","2023-10-02"]
["Factor Status","Issued"]
[]
[null,{"$f":"HYPERLINK(\"#'Factor List'!A1\",\"Back to Factor List\")","v":"Back to Factor List"}]
[]
[]
["Age","Contract length (years) 1","Contract length (years) 2","Contract length (years) 3","Contract length (years) 4","Contract length (years) 5","Contract length (years) 6","Contract length (years) 7","Contract length (years) 8","Contract length (years) 9","Contract length (years) 10","Contract length (years) 11","Contract length (years) 12","Contract length (years) 13","Contract length (years) 14","Contract length (years) 15","Contract length (years) 16","Contract length (years) 17","Contract length (years) 18","Contract length (years) 19","Contract length (years) 20","Contract length (years) 21","Contract length (years) 22","Contract length (years) 23","Contract length (years) 24","Contract length (years) 25","Contract length (years) 26","Contract length (years) 27","Contract length (years) 28","Contract length (years) 29","Contract length (years) 30","Contract length (years) 31","Contract length (years) 32","Contract length (years) 33","Contract length (years) 34","Contract length (years) 35","Contract length (years) 36","Contract length (years) 37","Contract length (years) 38","Contract length (years) 39","Contract length (years) 40","Contract length (years) 41","Contract length (years) 42","Contract length (years) 43","Contract length (years) 44","Contract length (years) 45","Contract length (years) 46","Contract length (years) 47","Contract length (years) 48"]
[16,null,null,null,null,null,null,null,null,null,23.99,22.19,20.69,19.43,18.350000000000001,17.420000000000002,16.600000000000001,15.89,15.26,14.69,14.19,13.73,13.32,12.95,12.61,12.3,12.01,11.75,11.51,11.28,11.08,10.88,10.71,10.54,10.38,10.24,10.1,9.98,9.86,9.75,9.64,9.5500000000000007,9.4499999999999993,9.3699999999999992,9.2899999999999991,9.2100000000000009,9.14,9.08,9.01]
[17,null,null,null,null,null,null,null,null,null,24.46,22.63,21.1,19.809999999999999,18.71,17.760000000000002,16.93,16.21,15.56,14.99,14.47,14.01,13.59,13.21,12.86,12.54,12.25,11.99,11.74,11.51,11.3,11.1,10.92,10.75,10.59,10.45,10.31,10.18,10.06,9.9499999999999993,9.84,9.74,9.65,9.56,9.48,9.41,9.33,9.27]
[18,null,null,null,null,null,null,null,null,null,25.01,23.13,21.57,20.25,19.13,18.16,17.309999999999999,16.57,15.91,15.32,14.79,14.32,13.89,13.5,13.15,12.82,12.53,12.25,12,11.77,11.55,11.35,11.17,11,10.83,10.68,10.54,10.41,10.29,10.18,10.07,9.9700000000000006,9.8699999999999992,9.7899999999999991,9.6999999999999993,9.6300000000000008,9.56]
[19,null,null,null,null,null,null,null,null,null,25.49,23.58,21.99,20.65,19.5,18.510000000000002,17.649999999999999,16.89,16.22,15.62,15.08,14.6,14.16,13.77,13.41,13.08,12.77,12.5,12.24,12,11.78,11.58,11.39,11.21,11.05,10.9,10.76,10.62,10.5,10.38,10.27,10.17,10.08,9.99,9.91,9.83]
[20,null,null,null,null,null,null,null,null,null,25.86,23.92,22.31,20.95,19.79,18.78,17.91,17.14,16.46,15.85,15.31,14.82,14.37,13.97,13.61,13.27,12.96,12.68,12.42,12.18,11.96,11.75,11.56,11.39,11.22,11.07,10.92,10.79,10.66,10.54,10.44,10.33,10.24,10.15,10.07]
[21,null,null,null,null,null,null,null,null,null,26.24,24.27,22.64,21.26,20.079999999999998,19.059999999999999,18.170000000000002,17.39,16.7,16.079999999999998,15.53,15.04,14.59,14.18,13.81,13.47,13.16,12.87,12.61,12.37,12.14,11.93,11.74,11.56,11.39,11.24,11.09,10.96,10.83,10.71,10.6,10.5,10.4,10.31]
[22,null,null,null,null,null,null,null,null,null,26.63,24.63,22.97,21.57,20.37,19.34,18.440000000000001,17.649999999999999,16.95,16.32,15.76,15.26,14.8,14.39,14.02,13.67,13.36,13.07,12.8,12.55,12.33,12.12,11.92,11.74,11.57,11.41,11.26,11.13,11,10.88,10.77,10.67,10.57]
[23,null,null,null,null,null,null,null,null,null,27.02,24.99,23.31,21.89,20.67,19.62,18.71,17.91,17.2,16.559999999999999,16,15.49,15.02,14.61,14.22,13.88,13.56,13.26,12.99,12.74,12.51,12.3,12.1,11.92,11.75,11.59,11.44,11.3,11.18,11.06,10.95,10.84]
[24,null,null,null,null,null,null,null,null,null,27.41,25.36,23.65,22.21,20.98,19.91,18.989999999999998,18.170000000000002,17.45,16.809999999999999,16.23,15.72,15.25,14.82,14.44,14.09,13.76,13.46,13.19,12.94,12.71,12.49,12.29,12.1,11.93,11.77,11.62,11.48,11.36,11.24,11.13]
[25,null,null,null,null,null,null,null,null,null,27.81,25.73,23.99,22.53,21.28,20.21,19.27,18.440000000000001,17.71,17.059999999999999,16.48,15.95,15.48,15.05,14.66,14.3,13.97,13.67,13.39,13.14,12.9,12.68,12.48,12.29,12.12,11.96,11.81,11.67,11.54,11.42]
[26,null,null,null,null,null,null,null,null,null,28.22,26.1,24.35,22.86,21.6,20.5,19.55,18.71,17.97,17.309999999999999,16.72,16.190000000000001,15.71,15.27,14.88,14.52,14.18,13.88,13.6,13.34,13.1,12.88,12.68,12.49,12.31,12.15,12,11.86,11.73]
[27,null,null,null,null,null,null,null,null,null,28.63,26.49,24.7,23.2,21.92,20.81,19.84,18.989999999999998,18.239999999999998,17.57,16.97,16.43,15.95,15.5,15.1,14.74,14.4,14.09,13.81,13.55,13.31,13.09,12.88,12.69,12.51,12.35,12.2,12.06]
[28,null,null,null,null,null,null,null,null,null,29.05,26.88,25.07,23.54,22.24,21.11,20.13,19.27,18.510000000000002,17.829999999999998,17.23,16.68,16.190000000000001,15.74,15.33,14.96,14.62,14.31,14.02,13.76,13.52,13.29,13.09,12.89,12.72,12.55,12.4]
[29,null,null,null,null,null,null,null,null,null,29.48,27.27,25.44,23.89,22.57,21.43,20.43,19.559999999999999,18.79,18.100000000000001,17.48,16.93,16.43,15.98,15.57,15.19,14.85,14.53,14.24,13.98,13.73,13.51,13.3,13.11,12.93,12.76]
[30,null,null,null,null,null,null,null,null,null,29.91,27.67,25.81,24.24,22.9,21.74,20.74,19.850000000000001,19.07,18.37,17.75,17.190000000000001,16.68,16.22,15.81,15.43,15.08,14.76,14.47,14.2,13.95,13.73,13.52,13.32,13.15]
[31,null,null,null,null,null,null,null,null,null,30.35,28.08,26.19,24.6,23.24,22.07,21.05,20.149999999999999,19.350000000000001,18.649999999999999,18.02,17.45,16.940000000000001,16.47,16.05,15.67,15.32,15,14.7,14.43,14.18,13.95,13.74,13.55]
[32,null,null,null,null,null,null,null,null,null,30.79,28.49,26.57,24.96,23.58,22.4,21.36,20.45,19.649999999999999,18.93,18.29,17.72,17.2,16.73,16.3,15.92,15.56,15.24,14.94,14.67,14.42,14.19,13.98]
[33,null,null,null,null,null,null,null,null,null,31.24,28.91,26.97,25.33,23.94,22.73,21.68,20.76,19.940000000000001,19.22,18.57,17.989999999999998,17.47,16.989999999999998,16.559999999999999,16.170000000000002,15.81,15.48,15.19,14.91,14.66,14.43]
[34,null,null,null,null,null,null,null,null,null,31.7,29.33,27.37,25.71,24.29,23.07,22.01,21.07,20.25,19.510000000000002,18.86,18.27,17.739999999999998,17.260000000000002,16.829999999999998,16.43,16.07,15.74,15.44,15.16,14.91]
[35,null,null,null,null,null,null,null,null,null,32.159999999999997,29.76,27.77,26.09,24.65,23.42,22.34,21.39,20.56,19.82,19.149999999999999,18.559999999999999,18.02,17.54,17.100000000000001,16.7,16.329999999999998,16,15.7,15.42]
[36,null,null,null,null,null,null,null,null,null,32.64,30.2,28.18,26.48,25.03,23.77,22.68,21.72,20.88,20.12,19.45,18.850000000000001,18.309999999999999,17.82,17.38,16.97,16.61,16.28,15.97]
[37,null,null,null,null,null,null,null,null,null,33.119999999999997,30.65,28.6,26.88,25.4,24.13,23.03,22.06,21.2,20.440000000000001,19.760000000000002,19.149999999999999,18.61,18.11,17.670000000000002,17.260000000000002,16.89,16.559999999999999]
[38,null,null,null,null,null,null,null,null,null,33.61,31.11,29.03,27.28,25.79,24.5,23.38,22.4,21.53,20.76,20.079999999999998,19.46,18.91,18.41,17.96,17.559999999999999,17.190000000000001]
[39,null,null,null,null,null,null,null,null,null,34.11,31.57,29.47,27.69,26.18,24.88,23.74,22.75,21.88,21.1,20.41,19.79,19.23,18.73,18.27,17.86]
[40,null,null,null,null,null,null,null,null,null,34.61,32.04,29.91,28.12,26.58,25.26,24.12,23.11,22.23,21.44,20.74,20.12,19.559999999999999,19.05,18.600000000000001]
[41,null,null,null,null,null,null,null,null,null,35.130000000000003,32.53,30.37,28.55,27,25.66,24.5,23.48,22.59,21.8,21.09,20.46,19.899999999999999,19.39]
[42,null,null,null,null,null,null,null,null,null,35.659999999999997,33.020000000000003,30.83,28.99,27.42,26.07,24.89,23.87,22.96,22.16,21.45,20.82,20.25]
[43,null,null,null,null,null,null,null,null,null,36.200000000000003,33.53,31.31,29.44,27.86,26.49,25.3,24.26,23.35,22.54,21.83,21.19]
[44,null,null,null,null,null,null,null,null,null,36.75,34.04,31.8,29.91,28.3,26.92,25.72,24.67,23.75,22.94,22.22]
[45,null,null,null,null,null,null,null,null,null,37.31,34.57,32.299999999999997,30.39,28.77,27.37,26.16,25.1,24.17,23.35]
[46,null,null,null,null,null,null,null,null,null,37.89,35.119999999999997,32.82,30.89,29.25,27.83,26.61,25.55,24.61]
[47,null,null,null,null,null,null,null,null,null,38.49,35.68,33.36,31.4,29.74,28.32,27.08,26.01]
[48,null,null,null,null,null,null,null,null,null,39.11,36.270000000000003,33.909999999999997,31.94,30.26,28.82,27.58]
[49,null,null,null,null,null,null,null,null,null,39.75,36.869999999999997,34.49,32.5,30.8,29.35]
[50,null,null,null,null,null,null,null,null,null,40.409999999999997,37.5,35.090000000000003,33.08,31.37]
[51,null,null,null,null,null,null,null,null,null,41.09,38.15,35.72,33.69]
[52,null,null,null,null,null,null,null,null,null,41.81,38.83,36.380000000000003]
[53,null,null,null,null,null,null,null,null,null,42.56,39.549999999999997]
[54,null,null,null,null,null,null,null,null,null,43.35]
[55]
[56]
[57]
[58]
[59]
[60]
[61]
[62]
[63]

{"sheet":"x-708","index":60,"n_rows":73,"n_cols":49,"rows_kept":73,"cut":false,"hidden":false,"merged":[]}
["Government Actuary's Department"]
[{"$f":"IF(TITLE=\"> Enter workbook title here\",\"Enter workbook title in Cover sheet\",TITLE)","v":"Local Government Pension Scheme (LGPS) - Consolidated Factor Spreadsheet"}]
["Added pension - x-708"]
[]
[]
["Data Item","Factor Table Information"]
["Scheme","LGPS_EW"]
["Section","2012-2014"]
["Factor Type","Added pension"]
["Description","Additional own and dependant's pension - regular monthly contributions - Females (elections between April 2012 and March 2014) - (monthly payment (£) to purchase £250 additional pension)"]
["Gender","Female"]
["Factor Age/Period Definition","Age at first contribution"]
["Section Number",0]
["Series Number",708]
["Table Reference","0-708"]
["Table Reference in Guidance","Table F"]
["Related Factor Guidance Note","LGPS EW Purchase of additional pension for elections  April 2012 to March 2014. 5 May 2021"]
["Date Factors Issued to Client","2023-09-26"]
["Date Factors Implemented (if known)","2023-10-02"]
["Factor Status","Issued"]
[]
[null,{"$f":"HYPERLINK(\"#'Factor List'!A1\",\"Back to Factor List\")","v":"Back to Factor List"}]
[]
[]
["Age","Contract length (years) 1","Contract length (years) 2","Contract length (years) 3","Contract length (years) 4","Contract length (years) 5","Contract length (years) 6","Contract length (years) 7","Contract length (years) 8","Contract length (years) 9","Contract length (years) 10","Contract length (years) 11","Contract length (years) 12","Contract length (years) 13","Contract length (years) 14","Contract length (years) 15","Contract length (years) 16","Contract length (years) 17","Contract length (years) 18","Contract length (years) 19","Contract length (years) 20","Contract length (years) 21","Contract length (years) 22","Contract length (years) 23","Contract length (years) 24","Contract length (years) 25","Contract length (years) 26","Contract length (years) 27","Contract length (years) 28","Contract length (years) 29","Contract length (years) 30","Contract length (years) 31","Contract length (years) 32","Contract length (years) 33","Contract length (years) 34","Contract length (years) 35","Contract length (years) 36","Contract length (years) 37","Contract length (years) 38","Contract length (years) 39","Contract length (years) 40","Contract length (years) 41","Contract length (years) 42","Contract length (years) 43","Contract length (years) 44","Contract length (years) 45","Contract length (years) 46","Contract length (years) 47","Contract length (years) 48"]
[16,null,null,null,null,null,null,null,null,null,24.57,22.73,21.19,19.899999999999999,18.79,17.829999999999998,17,16.27,15.62,15.04,14.52,14.06,13.63,13.25,12.9,12.58,12.29,12.02,11.77,11.54,11.33,11.13,10.94,10.77,10.61,10.46,10.32,10.19,10.07,9.9499999999999993,9.85,9.74,9.65,9.56,9.48,9.4,9.32,9.25,9.19]
[17,null,null,null,null,null,null,null,null,null,24.94,23.06,21.51,20.190000000000001,19.07,18.100000000000001,17.25,16.510000000000002,15.85,15.26,14.74,14.27,13.84,13.45,13.09,12.77,12.47,12.2,11.95,11.71,11.5,11.3,11.11,10.93,10.77,10.62,10.48,10.35,10.220000000000001,10.11,10,9.89,9.8000000000000007,9.7100000000000009,9.6199999999999992,9.5399999999999991,9.4700000000000006,9.4]
[18,null,null,null,null,null,null,null,null,null,25.31,23.41,21.83,20.49,19.350000000000001,18.37,17.510000000000002,16.75,16.09,15.49,14.96,14.48,14.04,13.65,13.29,12.96,12.66,12.38,12.12,11.89,11.67,11.47,11.28,11.1,10.94,10.78,10.64,10.5,10.38,10.26,10.15,10.050000000000001,9.9499999999999993,9.86,9.77,9.69,9.6199999999999992]
[19,null,null,null,null,null,null,null,null,null,25.68,23.75,22.15,20.8,19.64,18.64,17.77,17,16.329999999999998,15.72,15.18,14.69,14.25,13.85,13.49,13.15,12.85,12.57,12.31,12.07,11.84,11.64,11.45,11.27,11.1,10.95,10.8,10.67,10.54,10.42,10.31,10.199999999999999,10.11,10.01,9.93,9.85]
[20,null,null,null,null,null,null,null,null,null,26.06,24.1,22.48,21.1,19.93,18.920000000000002,18.03,17.260000000000002,16.57,15.96,15.41,14.91,14.47,14.06,13.69,13.35,13.04,12.76,12.49,12.25,12.02,11.81,11.62,11.44,11.27,11.11,10.97,10.83,10.7,10.58,10.47,10.36,10.27,10.17,10.09]
[21,null,null,null,null,null,null,null,null,null,26.45,24.46,22.81,21.42,20.23,19.2,18.3,17.510000000000002,16.82,16.190000000000001,15.64,15.14,14.68,14.27,13.89,13.55,13.24,12.95,12.68,12.43,12.21,11.99,11.8,11.61,11.44,11.28,11.14,11,10.87,10.75,10.63,10.53,10.43,10.34]
[22,null,null,null,null,null,null,null,null,null,26.84,24.82,23.15,21.73,20.53,19.48,18.57,17.77,17.07,16.43,15.87,15.36,14.9,14.48,14.1,13.75,13.44,13.14,12.87,12.62,12.39,12.18,11.98,11.79,11.62,11.46,11.31,11.17,11.04,10.92,10.8,10.7,10.6]
[23,null,null,null,null,null,null,null,null,null,27.24,25.19,23.49,22.06,20.83,19.77,18.850000000000001,18.04,17.32,16.68,16.11,15.59,15.12,14.7,14.31,13.96,13.64,13.34,13.07,12.81,12.58,12.36,12.16,11.97,11.8,11.64,11.49,11.34,11.21,11.09,10.97,10.87]
[24,null,null,null,null,null,null,null,null,null,27.64,25.56,23.84,22.38,21.14,20.07,19.13,18.309999999999999,17.579999999999998,16.93,16.350000000000001,15.82,15.35,14.92,14.53,14.17,13.84,13.54,13.27,13.01,12.77,12.55,12.35,12.16,11.98,11.82,11.67,11.52,11.39,11.27,11.15]
[25,null,null,null,null,null,null,null,null,null,28.05,25.94,24.19,22.71,21.45,20.36,19.41,18.579999999999998,17.84,17.18,16.59,16.059999999999999,15.58,15.15,14.75,14.39,14.05,13.75,13.47,13.21,12.97,12.75,12.54,12.35,12.17,12,11.85,11.71,11.57,11.45]
[26,null,null,null,null,null,null,null,null,null,28.46,26.33,24.55,23.05,21.77,20.67,19.7,18.86,18.11,17.440000000000001,16.84,16.3,15.82,15.37,14.97,14.6,14.27,13.96,13.67,13.41,13.17,12.94,12.73,12.54,12.36,12.19,12.04,11.9,11.76]
[27,null,null,null,null,null,null,null,null,null,28.88,26.71,24.91,23.39,22.09,20.97,20,19.14,18.38,17.7,17.09,16.55,16.05,15.61,15.2,14.83,14.49,14.17,13.88,13.62,13.37,13.14,12.93,12.74,12.56,12.39,12.23,12.09]
[28,null,null,null,null,null,null,null,null,null,29.31,27.11,25.28,23.74,22.42,21.28,20.29,19.420000000000002,18.649999999999999,17.96,17.350000000000001,16.8,16.3,15.84,15.43,15.05,14.71,14.39,14.1,13.83,13.58,13.35,13.14,12.94,12.76,12.59,12.43]
[29,null,null,null,null,null,null,null,null,null,29.74,27.51,25.66,24.09,22.76,21.6,20.6,19.71,18.93,18.23,17.61,17.05,16.54,16.079999999999998,15.66,15.28,14.93,14.61,14.32,14.05,13.79,13.56,13.35,13.15,12.97,12.8]
[30,null,null,null,null,null,null,null,null,null,30.18,27.92,26.04,24.45,23.09,21.92,20.9,20.010000000000002,19.21,18.510000000000002,17.88,17.309999999999999,16.79,16.329999999999998,15.9,15.52,15.16,14.84,14.54,14.27,14.01,13.78,13.56,13.36,13.18]
[31,null,null,null,null,null,null,null,null,null,30.63,28.33,26.42,24.81,23.44,22.25,21.22,20.309999999999999,19.5,18.79,18.149999999999999,17.57,17.05,16.579999999999998,16.149999999999999,15.76,15.4,15.07,14.77,14.49,14.24,14,13.78,13.58]
[32,null,null,null,null,null,null,null,null,null,31.08,28.75,26.81,25.18,23.79,22.58,21.53,20.61,19.8,19.07,18.420000000000002,17.84,17.309999999999999,16.829999999999998,16.399999999999999,16,15.64,15.31,15.01,14.73,14.47,14.23,14.01]
[33,null,null,null,null,null,null,null,null,null,31.54,29.17,27.21,25.56,24.14,22.92,21.86,20.92,20.100000000000001,19.36,18.7,18.11,17.579999999999998,17.100000000000001,16.66,16.260000000000002,15.89,15.55,15.25,14.97,14.71,14.47]
[34,null,null,null,null,null,null,null,null,null,32,29.61,27.62,25.94,24.5,23.26,22.19,21.24,20.399999999999999,19.66,18.989999999999998,18.39,17.850000000000001,17.36,16.920000000000002,16.510000000000002,16.14,15.81,15.5,15.21,14.95]
[35,null,null,null,null,null,null,null,null,null,32.479999999999997,30.05,28.03,26.32,24.87,23.61,22.52,21.56,20.71,19.96,19.28,18.68,18.13,17.64,17.190000000000001,16.78,16.399999999999999,16.059999999999999,15.75,15.47]
[36,null,null,null,null,null,null,null,null,null,32.96,30.49,28.44,26.72,25.24,23.97,22.86,21.89,21.03,20.27,19.579999999999998,18.97,18.420000000000002,17.920000000000002,17.46,17.05,16.670000000000002,16.329999999999998,16.02]
[37,null,null,null,null,null,null,null,null,null,33.44,30.94,28.87,27.12,25.62,24.33,23.21,22.22,21.35,20.58,19.89,19.27,18.71,18.2,17.75,17.329999999999998,16.95,16.61]
[38,null,null,null,null,null,null,null,null,null,33.94,31.41,29.3,27.53,26.01,24.7,23.57,22.57,21.69,20.9,20.2,19.579999999999998,19.010000000000002,18.5,18.04,17.62,17.239999999999998]
[39,null,null,null,null,null,null,null,null,null,34.450000000000003,31.88,29.74,27.94,26.41,25.08,23.93,22.92,22.03,21.23,20.53,19.89,19.32,18.809999999999999,18.34,17.920000000000002]
[40,null,null,null,null,null,null,null,null,null,34.96,32.35,30.19,28.37,26.81,25.47,24.3,23.28,22.37,21.57,20.86,20.22,19.64,19.12,18.649999999999999]
[41,null,null,null,null,null,null,null,null,null,35.479999999999997,32.840000000000003,30.65,28.8,27.22,25.86,24.68,23.65,22.73,21.92,21.2,20.55,19.97,19.45]
[42,null,null,null,null,null,null,null,null,null,36.020000000000003,33.340000000000003,31.12,29.24,27.65,26.27,25.07,24.03,23.1,22.28,21.55,20.9,20.32]
[43,null,null,null,null,null,null,null,null,null,36.56,33.85,31.59,29.7,28.08,26.69,25.48,24.42,23.48,22.66,21.92,21.26]
[44,null,null,null,null,null,null,null,null,null,37.119999999999997,34.369999999999997,32.08,30.16,28.53,27.12,25.89,24.82,23.88,23.04,22.3]
[45,null,null,null,null,null,null,null,null,null,37.69,34.9,32.590000000000003,30.64,28.98,27.56,26.32,25.24,24.29,23.45]
[46,null,null,null,null,null,null,null,null,null,38.270000000000003,35.450000000000003,33.1,31.14,29.46,28.02,26.77,25.67,24.71]
[47,null,null,null,null,null,null,null,null,null,38.869999999999997,36.01,33.64,31.64,29.95,28.49,27.23,26.13]
[48,null,null,null,null,null,null,null,null,null,39.479999999999997,36.590000000000003,34.19,32.17,30.46,28.98,27.71]
[49,null,null,null,null,null,null,null,null,null,40.119999999999997,37.18,34.76,32.72,30.98,29.5]
[50,null,null,null,null,null,null,null,null,null,40.770000000000003,37.799999999999997,35.35,33.29,31.54]
[51,null,null,null,null,null,null,null,null,null,41.45,38.450000000000003,35.96,33.880000000000003]
[52,null,null,null,null,null,null,null,null,null,42.16,39.119999999999997,36.61]
[53,null,null,null,null,null,null,null,null,null,42.89,39.82]
[54,null,null,null,null,null,null,null,null,null,43.66]
[55]
[56]
[57]
[58]
[59]
[60]
[61]
[62]
[63]

{"sheet":"x-711","index":61,"n_rows":84,"n_cols":5,"rows_kept":84,"cut":false,"hidden":false,"merged":[]}
["Government Actuary's Department"]
[{"$f":"IF(TITLE=\"> Enter workbook title here\",\"Enter workbook title in Cover sheet\",TITLE)","v":"Local Government Pension Scheme (LGPS) - Consolidated Factor Spreadsheet"}]
[{"$f":"TABLE_FACTOR_TYPE&\" - x-\"&TABLE_SERIES_NUMBER","v":"Added pension - x-711"}]
[]
[]
["Data Item","Factor Table Information"]
["Scheme","LGPS_EW"]
["Section","post 2014"]
["Factor Type","Added pension"]
["Description","Additional pension - lump sum contributions - Males (purchase of additional pension after 1 April 2014)"]
["Gender","Male"]
["Factor Age/Period Definition","Age at payment"]
["Section Number",0]
["Series Number",711]
["Table Reference","0-711"]
["Table Reference in Guidance","Table A"]
["Related Factor Guidance Note","LGPS EW Additional Pension post-2014 1 March 2019"]
["Date Factors Issued to Client","2023-09-26"]
["Date Factors Implemented (if known)","2023-10-02"]
["Factor Status","Issued"]
[]
[null,{"$f":"HYPERLINK(\"#'Factor List'!A1\",\"Back to Factor List\")","v":"Back to Factor List"}]
[]
[]
["Age","Lump sum contribution for an increase in pension of £100 a year - NPA 65","Lump sum contribution for an increase in pension of £100 a year - NPA 66","Lump sum contribution for an increase in pension of £100 a year - NPA 67","Lump sum contribution for an increase in pension of £100 a year - NPA 68"]
[16,891,852,815,779]
[17,904,865,827,791]
[18,917,877,839,802]
[19,930,890,851,814]
[20,944,903,864,826]
[21,958,916,876,837]
[22,972,930,889,850]
[23,986,943,902,862]
[24,1000,957,915,874]
[25,1015,971,928,887]
[26,1030,985,941,899]
[27,1045,999,955,912]
[28,1060,1013,969,925]
[29,1075,1028,982,939]
[30,1091,1043,997,952]
[31,1107,1058,1011,966]
[32,1123,1073,1025,979]
[33,1139,1089,1040,993]
[34,1156,1104,1055,1008]
[35,1172,1120,1070,1022]
[36,1189,1136,1085,1036]
[37,1206,1153,1101,1051]
[38,1224,1169,1117,1066]
[39,1242,1186,1132,1081]
[40,1259,1203,1149,1096]
[41,1278,1220,1165,1112]
[42,1296,1238,1181,1127]
[43,1315,1255,1198,1143]
[44,1333,1273,1215,1159]
[45,1353,1291,1232,1175]
[46,1372,1310,1250,1192]
[47,1392,1328,1267,1208]
[48,1412,1347,1285,1225]
[49,1432,1366,1303,1242]
[50,1453,1386,1321,1259]
[51,1474,1406,1340,1277]
[52,1495,1426,1359,1294]
[53,1517,1446,1378,1312]
[54,1540,1467,1398,1331]
[55,1563,1489,1418,1349]
[56,1586,1511,1438,1369]
[57,1611,1534,1459,1388]
[58,1636,1557,1481,1408]
[59,1662,1581,1504,1429]
[60,1690,1607,1527,1450]
[61,1719,1633,1551,1473]
[62,1749,1661,1577,1496]
[63,1782,1691,1604,1521]
[64,1817,1723,1634,1548]
[65,1833,1758,1665,1576]
[66,1828,1773,1700,1608]
[67,1824,1765,1713,1642]
[68,1821,1758,1703,1654]
[69,1817,1751,1693,1641]
[70,1815,1745,1683,1628]
[71,1814,1739,1672,1615]
[72,1814,1734,1663,1601]
[73,1816,1730,1654,1588]
[74,1820,1727,1646,1576]

{"sheet":"x-712","index":62,"n_rows":84,"n_cols":5,"rows_kept":84,"cut":false,"hidden":false,"merged":[]}
["Government Actuary's Department"]
[{"$f":"IF(TITLE=\"> Enter workbook title here\",\"Enter workbook title in Cover sheet\",TITLE)","v":"Local Government Pension Scheme (LGPS) - Consolidated Factor Spreadsheet"}]
[{"$f":"TABLE_FACTOR_TYPE&\" - x-\"&TABLE_SERIES_NUMBER","v":"Added pension - x-712"}]
[]
[]
["Data Item","Factor Table Information"]
["Scheme","LGPS_EW"]
["Section","post 2014"]
["Factor Type","Added pension"]
["Description","Additional pension - lump sum contributions - Females (purchase of additional pension after 1 April 2014)"]
["Gender","Female"]
["Factor Age/Period Definition","Age at payment"]
["Section Number",0]
["Series Number",712]
["Table Reference","0-712"]
["Table Reference in Guidance","Table B"]
["Related Factor Guidance Note","LGPS EW Additional Pension post-2014 1 March 2019"]
["Date Factors Issued to Client","2023-09-26"]
["Date Factors Implemented (if known)","2023-10-02"]
["Factor Status","Issued"]
[]
[null,{"$f":"HYPERLINK(\"#'Factor List'!A1\",\"Back to Factor List\")","v":"Back to Factor List"}]
[]
[]
["Age","Lump sum contribution for an increase in pension of £100 a year - NPA 65","Lump sum contribution for an increase in pension of £100 a year - NPA 66","Lump sum contribution for an increase in pension of £100 a year - NPA 67","Lump sum contribution for an increase in pension of £100 a year - NPA 68"]
[16,962,922,884,847]
[17,976,936,897,859]
[18,991,950,910,872]
[19,1006,964,924,885]
[20,1021,978,937,898]
[21,1036,993,951,911]
[22,1051,1008,965,924]
[23,1067,1023,980,938]
[24,1083,1038,994,952]
[25,1099,1053,1009,966]
[26,1115,1069,1024,980]
[27,1132,1085,1039,994]
[28,1149,1101,1054,1009]
[29,1166,1117,1069,1024]
[30,1183,1133,1085,1039]
[31,1200,1150,1101,1054]
[32,1218,1167,1117,1069]
[33,1236,1184,1134,1085]
[34,1254,1201,1150,1101]
[35,1273,1219,1167,1117]
[36,1292,1237,1184,1133]
[37,1311,1255,1201,1149]
[38,1330,1274,1219,1166]
[39,1350,1292,1236,1183]
[40,1369,1311,1254,1200]
[41,1390,1330,1273,1217]
[42,1410,1350,1291,1235]
[43,1431,1369,1310,1252]
[44,1452,1389,1329,1270]
[45,1473,1409,1348,1289]
[46,1494,1430,1367,1307]
[47,1516,1450,1387,1325]
[48,1538,1471,1407,1344]
[49,1561,1493,1427,1363]
[50,1584,1514,1447,1383]
[51,1607,1536,1468,1402]
[52,1630,1559,1489,1422]
[53,1654,1581,1510,1442]
[54,1679,1604,1532,1462]
[55,1704,1628,1554,1483]
[56,1729,1652,1577,1504]
[57,1755,1676,1599,1526]
[58,1782,1701,1623,1547]
[59,1810,1727,1647,1570]
[60,1838,1753,1671,1593]
[61,1868,1781,1697,1616]
[62,1899,1810,1724,1641]
[63,1932,1840,1751,1666]
[64,1967,1872,1781,1693]
[65,1986,1906,1812,1722]
[66,1988,1924,1846,1753]
[67,1992,1924,1862,1786]
[68,1996,1924,1859,1801]
[69,2001,1925,1856,1794]
[70,2007,1926,1853,1788]
[71,2015,1928,1851,1782]
[72,2024,1932,1849,1776]
[73,2035,1936,1848,1770]
[74,2048,1942,1848,1765]

{"sheet":"x-713","index":63,"n_rows":74,"n_cols":50,"rows_kept":74,"cut":false,"hidden":false,"merged":[]}
["Government Actuary's Department"]
[{"$f":"IF(TITLE=\"> Enter workbook title here\",\"Enter workbook title in Cover sheet\",TITLE)","v":"Local Government Pension Scheme (LGPS) - Consolidated Factor Spreadsheet"}]
[{"$f":"TABLE_FACTOR_TYPE&\" - x-\"&TABLE_SERIES_NUMBER","v":"Added pension - x-713"}]
[]
[]
["Data Item","Factor Table Information"]
["Scheme","LGPS_EW"]
["Section","post 2014"]
["Factor Type","Added pension"]
["Description","Additional pension - Regular monthly contributions - Males with NPA 65 (purchase of additional pension after 1 April 2014)"]
["Gender","Male"]
["Factor Age/Period Definition","Age at first contribution"]
["Section Number",0]
["Series Number",713]
["Table Reference","0-713"]
["Table Reference in Guidance","Table C"]
["Related Factor Guidance Note","LGPS EW Additional Pension post-2014 1 March 2019"]
["Date Factors Issued to Client","2023-09-26"]
["Date Factors Implemented (if known)","2023-10-02"]
["Factor Status","Issued"]
[]
[null,{"$f":"HYPERLINK(\"#'Factor List'!A1\",\"Back to Factor List\")","v":"Back to Factor List"}]
[]
[]
["Age","Arrangement length (years) 1","Arrangement length (years) 2","Arrangement length (years) 3","Arrangement length (years) 4","Arrangement length (years) 5","Arrangement length (years) 6","Arrangement length (years) 7","Arrangement length (years) 8","Arrangement length (years) 9","Arrangement length (years) 10","Arrangement length (years) 11","Arrangement length (years) 12","Arrangement length (years) 13","Arrangement length (years) 14","Arrangement length (years) 15","Arrangement length (years) 16","Arrangement length (years) 17","Arrangement length (years) 18","Arrangement length (years) 19","Arrangement length (years) 20","Arrangement length (years) 21","Arrangement length (years) 22","Arrangement length (years) 23","Arrangement length (years) 24","Arrangement length (years) 25","Arrangement length (years) 26","Arrangement length (years) 27","Arrangement length (years) 28","Arrangement length (years) 29","Arrangement length (years) 30","Arrangement length (years) 31","Arrangement length (years) 32","Arrangement length (years) 33","Arrangement length (years) 34","Arrangement length (years) 35","Arrangement length (years) 36","Arrangement length (years) 37","Arrangement length (years) 38","Arrangement length (years) 39","Arrangement length (years) 40","Arrangement length (years) 41","Arrangement length (years) 42","Arrangement length (years) 43","Arrangement length (years) 44","Arrangement length (years) 45","Arrangement length (years) 46","Arrangement length (years) 47","Arrangement length (years) 48","Arrangement length (years) 49"]
[16,74.67,38.020000000000003,25.81,19.71,16.05,13.62,11.88,10.58,9.57,8.77,8.11,7.56,7.1,6.71,6.36,6.07,5.81,5.58,5.37,5.19,5.0199999999999996,4.87,4.7300000000000004,4.6100000000000003,4.49,4.3899999999999997,4.29,4.21,4.12,4.05,3.98,3.91,3.85,3.79,3.74,3.69,3.65,3.6,3.56,3.52,3.49,3.46,3.42,3.39,3.37,3.34,3.32,3.29,3.26]
[17,75.760000000000005,38.58,26.19,20,16.29,13.82,12.06,10.74,9.7100000000000009,8.89,8.23,7.67,7.2,6.8,6.46,6.16,5.89,5.66,5.45,5.26,5.09,4.9400000000000004,4.8,4.68,4.5599999999999996,4.46,4.3600000000000003,4.2699999999999996,4.1900000000000004,4.1100000000000003,4.04,3.97,3.91,3.85,3.8,3.75,3.7,3.66,3.62,3.58,3.54,3.51,3.48,3.45,3.42,3.39,3.37,3.36]
[18,76.86,39.14,26.57,20.29,16.53,14.02,12.23,10.89,9.85,9.0299999999999994,8.35,7.78,7.31,6.9,6.55,6.25,5.98,5.74,5.53,5.34,5.17,5.01,4.87,4.75,4.63,4.5199999999999996,4.42,4.33,4.25,4.17,4.0999999999999996,4.03,3.97,3.91,3.86,3.81,3.76,3.71,3.67,3.63,3.6,3.56,3.53,3.5,3.47,3.45,3.44]
[19,77.98,39.71,26.96,20.59,16.77,14.23,12.41,11.05,10,9.16,8.4700000000000006,7.9,7.42,7.01,6.65,6.34,6.07,5.83,5.61,5.42,5.24,5.09,4.95,4.82,4.7,4.59,4.49,4.4000000000000004,4.3099999999999996,4.2300000000000004,4.16,4.09,4.03,3.97,3.92,3.86,3.82,3.77,3.73,3.69,3.65,3.62,3.59,3.56,3.53,3.52]
[20,79.12,40.29,27.35,20.89,17.010000000000002,14.43,12.59,11.22,10.15,9.2899999999999991,8.59,8.01,7.53,7.11,6.75,6.43,6.16,5.91,5.69,5.5,5.32,5.16,5.0199999999999996,4.8899999999999997,4.7699999999999996,4.66,4.5599999999999996,4.46,4.38,4.3,4.22,4.1500000000000004,4.09,4.03,3.98,3.92,3.88,3.83,3.79,3.75,3.71,3.68,3.65,3.62,3.6]
[21,80.28,40.880000000000003,27.75,21.19,17.260000000000002,14.64,12.78,11.38,10.29,9.43,8.7200000000000006,8.1300000000000008,7.64,7.21,6.85,6.53,6.25,6,5.78,5.58,5.4,5.24,5.09,4.96,4.84,4.7300000000000004,4.62,4.53,4.4400000000000004,4.3600000000000003,4.29,4.22,4.1500000000000004,4.09,4.04,3.98,3.94,3.89,3.85,3.81,3.77,3.74,3.71,3.69]
[22,81.44,41.47,28.16,21.5,17.510000000000002,14.86,12.96,11.55,10.44,9.57,8.85,8.25,7.75,7.32,6.95,6.62,6.34,6.09,5.86,5.66,5.48,5.32,5.17,5.03,4.91,4.8,4.6900000000000004,4.5999999999999996,4.51,4.43,4.3499999999999996,4.28,4.22,4.16,4.0999999999999996,4.05,4,3.95,3.91,3.87,3.83,3.8,3.78]
[23,82.63,42.08,28.57,21.82,17.77,15.08,13.15,11.71,10.6,9.7100000000000009,8.98,8.3699999999999992,7.86,7.43,7.05,6.72,6.43,6.18,5.95,5.75,5.56,5.4,5.25,5.1100000000000003,4.99,4.87,4.7699999999999996,4.67,4.58,4.5,4.42,4.3499999999999996,4.28,4.22,4.16,4.1100000000000003,4.0599999999999996,4.0199999999999996,3.97,3.93,3.9,3.87]
[24,83.83,42.69,28.98,22.13,18.03,15.3,13.35,11.89,10.75,9.85,9.11,8.5,7.98,7.54,7.15,6.82,6.53,6.27,6.04,5.83,5.65,5.48,5.33,5.19,5.0599999999999996,4.9400000000000004,4.84,4.74,4.6500000000000004,4.5599999999999996,4.49,4.42,4.3499999999999996,4.29,4.2300000000000004,4.18,4.13,4.08,4.04,4,3.97]
[25,85.05,43.31,29.4,22.46,18.29,15.52,13.54,12.06,10.91,9.99,9.24,8.6199999999999992,8.1,7.65,7.26,6.92,6.62,6.36,6.13,5.92,5.73,5.56,5.41,5.27,5.14,5.0199999999999996,4.91,4.8099999999999996,4.72,4.6399999999999997,4.5599999999999996,4.4800000000000004,4.42,4.3499999999999996,4.3,4.24,4.1900000000000004,4.1500000000000004,4.0999999999999996,4.08]
[26,86.28,43.94,29.83,22.78,18.559999999999999,15.74,13.74,12.24,11.07,10.14,9.3800000000000008,8.75,8.2100000000000009,7.76,7.37,7.02,6.72,6.46,6.22,6.01,5.82,5.64,5.49,5.34,5.21,5.0999999999999996,4.99,4.8899999999999997,4.79,4.71,4.63,4.5599999999999996,4.49,4.42,4.37,4.3099999999999996,4.26,4.22,4.18]
[27,87.53,44.58,30.27,23.11,18.829999999999998,15.97,13.94,12.41,11.23,10.29,9.52,8.8800000000000008,8.34,7.87,7.48,7.13,6.82,6.55,6.31,6.1,5.9,5.73,5.57,5.43,5.29,5.17,5.0599999999999996,4.96,4.87,4.78,4.7,4.63,4.5599999999999996,4.5,4.4400000000000004,4.38,4.33,4.3]
[28,88.8,45.22,30.71,23.45,19.100000000000001,16.21,14.14,12.6,11.4,10.44,9.66,9.01,8.4600000000000009,7.99,7.59,7.23,6.92,6.65,6.41,6.19,5.99,5.82,5.66,5.51,5.38,5.25,5.14,5.04,4.9400000000000004,4.8600000000000003,4.78,4.7,4.63,4.57,4.51,4.46,4.42]
[29,90.09,45.88,31.15,23.79,19.38,16.440000000000001,14.35,12.78,11.56,10.59,9.8000000000000007,9.14,8.58,8.11,7.7,7.34,7.03,6.75,6.5,6.28,6.08,5.9,5.74,5.59,5.46,5.34,5.22,5.12,5.0199999999999996,4.93,4.8499999999999996,4.78,4.71,4.6500000000000004,4.59,4.54]
[30,91.4,46.55,31.6,24.14,19.66,16.68,14.56,12.97,11.73,10.75,9.94,9.27,8.7100000000000009,8.23,7.81,7.45,7.13,6.85,6.6,6.38,6.18,5.99,5.83,5.68,5.54,5.42,5.3,5.2,5.0999999999999996,5.01,4.93,4.8600000000000003,4.79,4.72,4.68]
[31,92.72,47.22,32.06,24.49,19.95,16.93,14.77,13.16,11.9,10.91,10.09,9.41,8.84,8.35,7.93,7.56,7.24,6.96,6.7,6.47,6.27,6.09,5.92,5.77,5.63,5.5,5.39,5.28,5.19,5.0999999999999996,5.01,4.9400000000000004,4.87,4.82]
[32,94.06,47.9,32.53,24.85,20.239999999999998,17.170000000000002,14.99,13.35,12.08,11.07,10.24,9.5500000000000007,8.9700000000000006,8.48,8.0500000000000007,7.68,7.35,7.06,6.8,6.57,6.37,6.18,6.01,5.86,5.72,5.59,5.48,5.37,5.27,5.18,5.0999999999999996,5.0199999999999996,4.97]
[33,95.42,48.6,33,25.21,20.53,17.420000000000002,15.21,13.55,12.26,11.23,10.39,9.69,9.11,8.6,8.17,7.79,7.46,7.17,6.91,6.68,6.47,6.28,6.11,5.95,5.81,5.68,5.57,5.46,5.36,5.27,5.19,5.12]
[34,96.8,49.3,33.479999999999997,25.57,20.83,17.68,15.43,13.75,12.44,11.4,10.54,9.84,9.24,8.73,8.2899999999999991,7.91,7.58,7.28,7.02,6.78,6.57,6.38,6.2,6.05,5.91,5.78,5.66,5.55,5.45,5.36,5.29]
[35,98.2,50.02,33.96,25.94,21.14,17.940000000000001,15.66,13.95,12.62,11.56,10.7,9.98,9.3800000000000008,8.86,8.42,8.0299999999999994,7.69,7.39,7.12,6.89,6.67,6.48,6.3,6.15,6,5.87,5.75,5.64,5.55,5.47]
[36,99.61,50.74,34.46,26.32,21.45,18.2,15.89,14.15,12.81,11.74,10.86,10.130000000000001,9.52,9,8.5500000000000007,8.16,7.81,7.51,7.24,7,6.78,6.58,6.41,6.25,6.1,5.97,5.85,5.74,5.65]
[37,101.05,51.47,34.96,26.71,21.76,18.47,16.12,14.36,13,11.91,11.02,10.29,9.67,9.14,8.68,8.2799999999999994,7.93,7.62,7.35,7.11,6.89,6.69,6.51,6.35,6.21,6.08,5.95,5.86]
[38,102.51,52.22,35.47,27.1,22.08,18.739999999999998,16.36,14.58,13.19,12.09,11.19,10.44,9.81,9.2799999999999994,8.81,8.41,8.06,7.75,7.47,7.22,7,6.8,6.62,6.46,6.32,6.18,6.07]
[39,103.99,52.98,35.979999999999997,27.49,22.4,19.010000000000002,16.600000000000001,14.79,13.39,12.27,11.36,10.6,9.9600000000000009,9.42,8.9499999999999993,8.5399999999999991,8.19,7.87,7.59,7.34,7.12,6.92,6.74,6.57,6.43,6.3]
[40,105.49,53.74,36.5,27.89,22.73,19.3,16.850000000000001,15.01,13.59,12.46,11.53,10.76,10.119999999999999,9.57,9.09,8.68,8.32,8,7.72,7.46,7.24,7.04,6.86,6.69,6.55]
[41,107.01,54.52,37.03,28.3,23.06,19.579999999999998,17.100000000000001,15.24,13.8,12.65,11.71,10.93,10.28,9.7200000000000006,9.24,8.82,8.4499999999999993,8.1300000000000008,7.85,7.59,7.37,7.16,6.98,6.82]
[42,108.55,55.31,37.57,28.71,23.4,19.87,17.350000000000001,15.47,14.01,12.84,11.89,11.1,10.44,9.8699999999999992,9.39,8.9600000000000009,8.59,8.27,7.98,7.72,7.5,7.29,7.12]
[43,110.11,56.11,38.119999999999997,29.14,23.75,20.170000000000002,17.61,15.7,14.22,13.04,12.08,11.28,10.61,10.029999999999999,9.5399999999999991,9.11,8.74,8.41,8.1199999999999992,7.86,7.63,7.44]
[44,111.7,56.93,38.68,29.56,24.1,20.47,17.88,15.94,14.44,13.24,12.27,11.46,10.78,10.199999999999999,9.6999999999999993,9.27,8.89,8.56,8.27,8.01,7.78]
[45,113.31,57.75,39.24,30,24.46,20.78,18.149999999999999,16.190000000000001,14.66,13.45,12.46,11.64,10.95,10.37,9.8699999999999992,9.43,9.0500000000000007,8.7100000000000009,8.42,8.16]
[46,114.95,58.59,39.82,30.45,24.83,21.09,18.43,16.440000000000001,14.89,13.66,12.66,11.84,11.14,10.55,10.039999999999999,9.6,9.2100000000000009,8.8699999999999992,8.58]
[47,116.61,59.45,40.409999999999997,30.9,25.2,21.41,18.71,16.7,15.13,13.89,12.87,12.03,11.33,10.73,10.220000000000001,9.77,9.3800000000000008,9.0500000000000007]
[48,118.3,60.32,41.01,31.36,25.59,21.74,19.010000000000002,16.96,15.38,14.12,13.09,12.24,11.53,10.92,10.4,9.9499999999999993,9.57]
[49,120.01,61.2,41.62,31.84,25.98,22.08,19.309999999999999,17.239999999999998,15.63,14.35,13.31,12.45,11.73,11.12,10.6,10.15]
[50,121.76,62.11,42.24,32.32,26.38,22.43,19.62,17.52,15.89,14.6,13.55,12.68,11.95,11.33,10.81]
[51,123.55,63.04,42.88,32.82,26.8,22.79,19.940000000000001,17.809999999999999,16.170000000000002,14.86,13.79,12.91,12.18,11.56]
[52,125.38,63.99,43.54,33.340000000000003,27.23,23.17,20.28,18.12,16.45,15.13,14.05,13.16,12.42]
[53,127.25,64.959999999999994,44.22,33.869999999999997,27.67,23.55,20.62,18.440000000000001,16.75,15.41,14.32,13.42]
[54,129.16999999999999,65.97,44.92,34.42,28.13,23.96,20.99,18.77,17.059999999999999,15.71,14.6]
[55,131.15,67,45.65,34.99,28.61,24.38,21.37,19.13,17.39,16.02]
[56,133.19999999999999,68.08,46.4,35.590000000000003,29.12,24.82,21.77,19.5,17.739999999999998]
[57,135.32,69.2,47.19,36.21,29.65,25.29,22.2,19.88]
[58,137.51,70.36,48.01,36.869999999999997,30.2,25.79,22.64]
[59,139.81,71.58,48.88,37.56,30.8,26.3]
[60,142.22,72.87,49.8,38.299999999999997,31.41]
[61,144.76,74.23,50.78,39.06]
[62,147.46,75.69,51.78]
[63,150.33000000000001,77.19]
[64,153.30000000000001]

{"sheet":"x-714","index":64,"n_rows":74,"n_cols":50,"rows_kept":74,"cut":false,"hidden":false,"merged":[]}
["Government Actuary's Department"]
[{"$f":"IF(TITLE=\"> Enter workbook title here\",\"Enter workbook title in Cover sheet\",TITLE)","v":"Local Government Pension Scheme (LGPS) - Consolidated Factor Spreadsheet"}]
[{"$f":"TABLE_FACTOR_TYPE&\" - x-\"&TABLE_SERIES_NUMBER","v":"Added pension - x-714"}]
[]
[]
["Data Item","Factor Table Information"]
["Scheme","LGPS_EW"]
["Section","post 2014"]
["Factor Type","Added pension"]
["Description","Additional pension - Regular monthly contributions - Females with NPA 65 (purchase of additional pension after 1 April 2014)"]
["Gender","Female"]
["Factor Age/Period Definition","Age at first contribution"]
["Section Number",0]
["Series Number",714]
["Table Reference","0-714"]
["Table Reference in Guidance","Table D"]
["Related Factor Guidance Note","LGPS EW Additional Pension post-2014 1 March 2019"]
["Date Factors Issued to Client","2023-09-26"]
["Date Factors Implemented (if known)","2023-10-02"]
["Factor Status","Issued"]
[]
[null,{"$f":"HYPERLINK(\"#'Factor List'!A1\",\"Back to Factor List\")","v":"Back to Factor List"}]
[]
[]
["Age","Arrangement length (years) 1","Arrangement length (years) 2","Arrangement length (years) 3","Arrangement length (years) 4","Arrangement length (years) 5","Arrangement length (years) 6","Arrangement length (years) 7","Arrangement length (years) 8","Arrangement length (years) 9","Arrangement length (years) 10","Arrangement length (years) 11","Arrangement length (years) 12","Arrangement length (years) 13","Arrangement length (years) 14","Arrangement length (years) 15","Arrangement length (years) 16","Arrangement length (years) 17","Arrangement length (years) 18","Arrangement length (years) 19","Arrangement length (years) 20","Arrangement length (years) 21","Arrangement length (years) 22","Arrangement length (years) 23","Arrangement length (years) 24","Arrangement length (years) 25","Arrangement length (years) 26","Arrangement length (years) 27","Arrangement length (years) 28","Arrangement length (years) 29","Arrangement length (years) 30","Arrangement length (years) 31","Arrangement length (years) 32","Arrangement length (years) 33","Arrangement length (years) 34","Arrangement length (years) 35","Arrangement length (years) 36","Arrangement length (years) 37","Arrangement length (years) 38","Arrangement length (years) 39","Arrangement length (years) 40","Arrangement length (years) 41","Arrangement length (years) 42","Arrangement length (years) 43","Arrangement length (years) 44","Arrangement length (years) 45","Arrangement length (years) 46","Arrangement length (years) 47","Arrangement length (years) 48","Arrangement length (years) 49"]
[16,80.790000000000006,41.14,27.92,21.32,17.37,14.73,12.85,11.44,10.35,9.48,8.77,8.17,7.68,7.25,6.88,6.56,6.28,6.02,5.8,5.6,5.42,5.26,5.1100000000000003,4.9800000000000004,4.8499999999999996,4.74,4.6399999999999997,4.54,4.45,4.37,4.29,4.22,4.16,4.09,4.04,3.98,3.93,3.88,3.84,3.8,3.76,3.72,3.69,3.66,3.62,3.6,3.57,3.54,3.5]
[17,81.99,41.75,28.34,21.64,17.63,14.95,13.04,11.62,10.51,9.6199999999999992,8.9,8.3000000000000007,7.79,7.36,6.98,6.66,6.37,6.12,5.89,5.69,5.5,5.34,5.19,5.05,4.93,4.8099999999999996,4.71,4.6100000000000003,4.5199999999999996,4.4400000000000004,4.3600000000000003,4.29,4.22,4.16,4.0999999999999996,4.04,3.99,3.94,3.9,3.86,3.82,3.78,3.75,3.71,3.68,3.65,3.63,3.61]
[18,83.22,42.37,28.76,21.96,17.89,15.17,13.24,11.79,10.66,9.76,9.0299999999999994,8.42,7.91,7.47,7.09,6.76,6.46,6.21,5.98,5.77,5.59,5.42,5.27,5.13,5,4.88,4.78,4.68,4.59,4.5,4.42,4.3499999999999996,4.28,4.22,4.16,4.0999999999999996,4.05,4,3.96,3.92,3.88,3.84,3.8,3.77,3.74,3.71,3.69]
[19,84.45,43,29.19,22.29,18.149999999999999,15.4,13.44,11.96,10.82,9.91,9.17,8.5500000000000007,8.02,7.58,7.19,6.86,6.56,6.3,6.07,5.86,5.67,5.5,5.35,5.2,5.08,4.96,4.8499999999999996,4.75,4.66,4.57,4.49,4.42,4.3499999999999996,4.28,4.22,4.17,4.12,4.07,4.0199999999999996,3.98,3.94,3.9,3.86,3.83,3.8,3.78]
[20,85.71,43.64,29.63,22.62,18.43,15.63,13.64,12.14,10.98,10.06,9.3000000000000007,8.67,8.14,7.69,7.3,6.96,6.66,6.39,6.16,5.95,5.76,5.58,5.43,5.28,5.15,5.03,4.92,4.82,4.7300000000000004,4.6399999999999997,4.5599999999999996,4.4800000000000004,4.41,4.3499999999999996,4.29,4.2300000000000004,4.18,4.13,4.08,4.04,4,3.96,3.93,3.89,3.87]
[21,86.99,44.29,30.07,22.96,18.7,15.86,13.84,12.32,11.15,10.210000000000001,9.44,8.8000000000000007,8.27,7.81,7.41,7.06,6.76,6.49,6.25,6.04,5.84,5.67,5.51,5.36,5.23,5.1100000000000003,5,4.8899999999999997,4.8,4.71,4.63,4.55,4.4800000000000004,4.42,4.3600000000000003,4.3,4.24,4.1900000000000004,4.1500000000000004,4.0999999999999996,4.0599999999999996,4.03,3.99,3.96]
[22,88.28,44.95,30.51,23.3,18.98,16.100000000000001,14.04,12.51,11.31,10.36,9.58,8.93,8.39,7.92,7.52,7.17,6.86,6.59,6.34,6.13,5.93,5.75,5.59,5.44,5.31,5.19,5.07,4.97,4.87,4.78,4.7,4.62,4.55,4.49,4.42,4.37,4.3099999999999996,4.26,4.21,4.17,4.13,4.09,4.0599999999999996]
[23,89.59,45.62,30.97,23.65,19.260000000000002,16.34,14.25,12.69,11.48,10.51,9.7200000000000006,9.07,8.51,8.0399999999999991,7.63,7.28,6.96,6.69,6.44,6.22,6.02,5.84,5.68,5.53,5.39,5.26,5.15,5.04,4.95,4.8600000000000003,4.7699999999999996,4.6900000000000004,4.62,4.55,4.49,4.43,4.38,4.33,4.28,4.24,4.2,4.16]
[24,90.92,46.29,31.43,24,19.55,16.579999999999998,14.47,12.88,11.65,10.67,9.8699999999999992,9.1999999999999993,8.64,8.16,7.75,7.39,7.07,6.79,6.54,6.31,6.11,5.93,5.76,5.61,5.47,5.35,5.23,5.12,5.0199999999999996,4.93,4.8499999999999996,4.7699999999999996,4.6900000000000004,4.63,4.5599999999999996,4.5,4.45,4.4000000000000004,4.3499999999999996,4.3099999999999996,4.2699999999999996]
[25,92.26,46.98,31.89,24.35,19.84,16.829999999999998,14.68,13.07,11.83,10.83,10.02,9.34,8.77,8.2799999999999994,7.86,7.5,7.17,6.89,6.63,6.41,6.2,6.02,5.85,5.69,5.55,5.43,5.31,5.2,5.0999999999999996,5.01,4.92,4.84,4.7699999999999996,4.7,4.6399999999999997,4.58,4.5199999999999996,4.47,4.42,4.38]
[26,93.63,47.68,32.369999999999997,24.72,20.13,17.079999999999998,14.9,13.27,12,10.99,10.17,9.48,8.9,8.41,7.98,7.61,7.28,6.99,6.73,6.5,6.3,6.11,5.94,5.78,5.64,5.51,5.39,5.28,5.18,5.08,5,4.92,4.84,4.7699999999999996,4.71,4.6500000000000004,4.59,4.54,4.5]
[27,95.02,48.38,32.85,25.08,20.43,17.329999999999998,15.12,13.46,12.18,11.15,10.32,9.6199999999999992,9.0299999999999994,8.5299999999999994,8.1,7.72,7.39,7.1,6.84,6.6,6.39,6.2,6.03,5.87,5.73,5.59,5.47,5.36,5.26,5.16,5.08,5,4.92,4.8499999999999996,4.79,4.72,4.67,4.62]
[28,96.42,49.1,33.33,25.45,20.73,17.59,15.34,13.67,12.36,11.32,10.47,9.77,9.17,8.66,8.2200000000000006,7.84,7.5,7.2,6.94,6.7,6.49,6.29,6.12,5.96,5.81,5.68,5.56,5.45,5.34,5.25,5.16,5.08,5,4.93,4.8600000000000003,4.8,4.75]
[29,97.85,49.83,33.83,25.83,21.04,17.850000000000001,15.57,13.87,12.55,11.49,10.63,9.91,9.31,8.7899999999999991,8.35,7.96,7.62,7.31,7.04,6.8,6.59,6.39,6.21,6.05,5.9,5.77,5.64,5.53,5.43,5.33,5.24,5.16,5.08,5.01,4.9400000000000004,4.8899999999999997]
[30,99.29,50.56,34.33,26.21,21.35,18.11,15.8,14.07,12.73,11.66,10.79,10.06,9.4499999999999993,8.92,8.4700000000000006,8.08,7.73,7.42,7.15,6.91,6.69,6.49,6.31,6.15,6,5.86,5.73,5.62,5.51,5.41,5.32,5.24,5.16,5.09,5.03]
[31,100.76,51.31,34.83,26.6,21.67,18.38,16.04,14.28,12.92,11.83,10.95,10.210000000000001,9.59,9.06,8.6,8.1999999999999993,7.85,7.54,7.26,7.01,6.79,6.59,6.41,6.24,6.09,5.95,5.82,5.71,5.6,5.5,5.41,5.33,5.25,5.18]
[32,102.25,52.07,35.35,27,21.99,18.649999999999999,16.28,14.5,13.11,12.01,11.11,10.36,9.73,9.19,8.73,8.32,7.97,7.65,7.37,7.12,6.89,6.69,6.51,6.34,6.19,6.05,5.92,5.8,5.69,5.59,5.5,5.42,5.34]
[33,103.75,52.84,35.869999999999997,27.4,22.31,18.93,16.52,14.71,13.31,12.19,11.28,10.52,9.8800000000000008,9.33,8.86,8.4499999999999993,8.09,7.77,7.48,7.23,7,6.8,6.61,6.44,6.28,6.14,6.01,5.89,5.79,5.68,5.59,5.51]
[34,105.28,53.61,36.4,27.8,22.65,19.21,16.760000000000002,14.93,13.51,12.37,11.45,10.68,10.029999999999999,9.4700000000000006,8.99,8.58,8.2100000000000009,7.89,7.6,7.34,7.11,6.9,6.71,6.54,6.38,6.24,6.11,5.99,5.88,5.78,5.69]
[35,106.83,54.41,36.94,28.21,22.98,19.5,17.010000000000002,15.15,13.71,12.56,11.62,10.84,10.18,9.6199999999999992,9.1300000000000008,8.7100000000000009,8.34,8.01,7.72,7.46,7.22,7.01,6.82,6.65,6.49,6.34,6.21,6.09,5.98,5.89]
[36,108.4,55.21,37.479999999999997,28.63,23.32,19.79,17.27,15.38,13.92,12.75,11.79,11,10.33,9.76,9.27,8.84,8.4700000000000006,8.1300000000000008,7.84,7.57,7.34,7.12,6.93,6.75,6.59,6.45,6.32,6.2,6.09]
[37,110,56.02,38.04,29.05,23.67,20.079999999999998,17.52,15.61,14.12,12.94,11.97,11.17,10.49,9.91,9.41,8.98,8.6,8.26,7.96,7.69,7.45,7.24,7.04,6.87,6.7,6.56,6.42,6.31]
[38,111.61,56.85,38.6,29.48,24.02,20.38,17.79,15.84,14.34,13.13,12.15,11.34,10.65,10.07,9.56,9.1199999999999992,8.73,8.39,8.09,7.82,7.58,7.36,7.16,6.98,6.82,6.67,6.54]
[39,113.25,57.68,39.17,29.92,24.37,20.68,18.05,16.079999999999998,14.55,13.33,12.34,11.51,10.82,10.220000000000001,9.7100000000000009,9.26,8.8699999999999992,8.5299999999999994,8.2200000000000006,7.94,7.7,7.48,7.28,7.1,6.94,6.79]
[40,114.92,58.53,39.75,30.36,24.74,20.99,18.32,16.32,14.77,13.54,12.53,11.69,10.98,10.38,9.86,9.41,9.01,8.66,8.35,8.08,7.83,7.6,7.4,7.22,7.06]
[41,116.6,59.39,40.33,30.81,25.1,21.31,18.600000000000001,16.57,15,13.74,12.72,11.87,11.15,10.54,10.02,9.56,9.16,8.8000000000000007,8.49,8.2100000000000009,7.96,7.74,7.53,7.35]
[42,118.31,60.27,40.93,31.27,25.48,21.62,18.88,16.82,15.22,13.95,12.91,12.05,11.33,10.71,10.18,9.7100000000000009,9.31,8.9499999999999993,8.6300000000000008,8.35,8.1,7.87,7.67]
[43,120.04,61.15,41.53,31.73,25.86,21.95,19.16,17.079999999999998,15.46,14.17,13.12,12.24,11.51,10.88,10.34,9.8699999999999992,9.4600000000000009,9.1,8.7799999999999994,8.49,8.24,8.01]
[44,121.8,62.05,42.15,32.200000000000003,26.25,22.28,19.45,17.34,15.7,14.39,13.32,12.44,11.69,11.06,10.51,10.039999999999999,9.6199999999999992,9.26,8.93,8.64,8.39]
[45,123.59,62.97,42.77,32.68,26.64,22.62,19.75,17.600000000000001,15.94,14.61,13.53,12.64,11.88,11.24,10.69,10.210000000000001,9.7899999999999991,9.42,9.09,8.8000000000000007]
[46,125.4,63.9,43.41,33.17,27.04,22.96,20.05,17.88,16.190000000000001,14.84,13.75,12.84,12.08,11.43,10.87,10.38,9.9600000000000009,9.59,9.26]
[47,127.24,64.84,44.05,33.67,27.45,23.31,20.36,18.149999999999999,16.440000000000001,15.08,13.97,13.05,12.28,11.62,11.05,10.56,10.14,9.76]
[48,129.1,65.8,44.71,34.18,27.87,23.67,20.68,18.440000000000001,16.71,15.33,14.2,13.27,12.49,11.82,11.25,10.76,10.32]
[49,131,66.77,45.38,34.700000000000003,28.3,24.04,21,18.73,16.98,15.58,14.44,13.5,12.7,12.03,11.45,10.95]
[50,132.93,67.77,46.06,35.229999999999997,28.73,24.41,21.34,19.04,17.260000000000002,15.84,14.69,13.73,12.93,12.25,11.66]
[51,134.9,68.78,46.76,35.770000000000003,29.18,24.8,21.68,19.350000000000001,17.55,16.11,14.94,13.98,13.17,12.47]
[52,136.9,69.819999999999993,47.48,36.32,29.64,25.2,22.04,19.670000000000002,17.84,16.39,15.21,14.23,13.41]
[53,138.94,70.88,48.21,36.89,30.12,25.61,22.4,20.010000000000002,18.16,16.690000000000001,15.49,14.49]
[54,141.03,71.959999999999994,48.96,37.479999999999997,30.6,26.04,22.79,20.36,18.48,16.989999999999998,15.77]
[55,143.16999999999999,73.069999999999993,49.73,38.08,31.11,26.48,23.18,20.73,18.829999999999998,17.3]
[56,145.35,74.22,50.53,38.71,31.64,26.94,23.6,21.11,19.170000000000002]
[57,147.6,75.400000000000006,51.36,39.36,32.19,27.42,24.04,21.49]
[58,149.91999999999999,76.62,52.22,40.04,32.76,27.93,24.48]
[59,152.32,77.89,53.11,40.76,33.369999999999997,28.44]
[60,154.82,79.209999999999994,54.06,41.51,33.979999999999997]
[61,157.44,80.61,55.05,42.27]
[62,160.19,82.09,56.05]
[63,163.09,83.58]
[64,166.05]

{"sheet":"x-715","index":65,"n_rows":75,"n_cols":51,"rows_kept":75,"cut":false,"hidden":false,"merged":[]}
["Government Actuary's Department"]
[{"$f":"IF(TITLE=\"> Enter workbook title here\",\"Enter workbook title in Cover sheet\",TITLE)","v":"Local Government Pension Scheme (LGPS) - Consolidated Factor Spreadsheet"}]
[{"$f":"TABLE_FACTOR_TYPE&\" - x-\"&TABLE_SERIES_NUMBER","v":"Added pension - x-715"}]
[]
[]
["Data Item","Factor Table Information"]
["Scheme","LGPS_EW"]
["Section","post 2014"]
["Factor Type","Added pension"]
["Description","Additional pension - Regular monthly contributions - Males with NPA 66 (purchase of additional pension after 1 April 2014)"]
["Gender","Male"]
["Factor Age/Period Definition","Age at first contribution"]
["Section Number",0]
["Series Number",715]
["Table Reference","0-715"]
["Table Reference in Guidance","Table E"]
["Related Factor Guidance Note","LGPS EW Additional Pension post-2014 1 March 2019"]
["Date Factors Issued to Client","2023-09-26"]
["Date Factors Implemented (if known)","2023-10-02"]
["Factor Status","Issued"]
[]
[null,{"$f":"HYPERLINK(\"#'Factor List'!A1\",\"Back to Factor List\")","v":"Back to Factor List"}]
[]
[]
["Age","Arrangement length (years) 1","Arrangement length (years) 2","Arrangement length (years) 3","Arrangement length (years) 4","Arrangement length (years) 5","Arrangement length (years) 6","Arrangement length (years) 7","Arrangement length (years) 8","Arrangement length (years) 9","Arrangement length (years) 10","Arrangement length (years) 11","Arrangement length (years) 12","Arrangement length (years) 13","Arrangement length (years) 14","Arrangement length (years) 15","Arrangement length (years) 16","Arrangement length (years) 17","Arrangement length (years) 18","Arrangement length (years) 19","Arrangement length (years) 20","Arrangement length (years) 21","Arrangement length (years) 22","Arrangement length (years) 23","Arrangement length (years) 24","Arrangement length (years) 25","Arrangement length (years) 26","Arrangement length (years) 27","Arrangement length (years) 28","Arrangement length (years) 29","Arrangement length (years) 30","Arrangement length (years) 31","Arrangement length (years) 32","Arrangement length (years) 33","Arrangement length (years) 34","Arrangement length (years) 35","Arrangement length (years) 36","Arrangement length (years) 37","Arrangement length (years) 38","Arrangement length (years) 39","Arrangement length (years) 40","Arrangement length (years) 41","Arrangement length (years) 42","Arrangement length (years) 43","Arrangement length (years) 44","Arrangement length (years) 45","Arrangement length (years) 46","Arrangement length (years) 47","Arrangement length (years) 48","Arrangement length (years) 49","Arrangement length (years) 50"]
[16,71.430000000000007,36.369999999999997,24.69,18.86,15.36,13.03,11.37,10.119999999999999,9.16,8.39,7.76,7.23,6.79,6.41,6.09,5.8,5.55,5.33,5.14,4.96,4.8,4.66,4.53,4.41,4.3,4.2,4.1100000000000003,4.0199999999999996,3.94,3.87,3.81,3.74,3.68,3.63,3.58,3.53,3.49,3.45,3.41,3.37,3.34,3.31,3.28,3.25,3.22,3.2,3.17,3.15,3.13,3.1]
[17,72.47,36.9,25.05,19.13,15.58,13.22,11.53,10.27,9.2899999999999991,8.51,7.87,7.34,6.89,6.51,6.18,5.89,5.64,5.41,5.21,5.03,4.87,4.7300000000000004,4.59,4.47,4.3600000000000003,4.26,4.17,4.08,4,3.93,3.86,3.8,3.74,3.68,3.63,3.59,3.54,3.5,3.46,3.42,3.39,3.36,3.33,3.3,3.27,3.25,3.22,3.2,3.19]
[18,73.52,37.44,25.42,19.41,15.81,13.41,11.7,10.42,9.43,8.6300000000000008,7.98,7.45,6.99,6.6,6.27,5.98,5.72,5.49,5.29,5.1100000000000003,4.9400000000000004,4.8,4.66,4.54,4.43,4.32,4.2300000000000004,4.1399999999999997,4.0599999999999996,3.99,3.92,3.86,3.8,3.74,3.69,3.64,3.59,3.55,3.51,3.48,3.44,3.41,3.38,3.35,3.32,3.3,3.28,3.27]
[19,74.59,37.979999999999997,25.79,19.690000000000001,16.04,13.61,11.87,10.57,9.56,8.76,8.1,7.55,7.09,6.7,6.36,6.06,5.8,5.57,5.37,5.18,5.0199999999999996,4.87,4.7300000000000004,4.6100000000000003,4.49,4.3899999999999997,4.29,4.21,4.12,4.05,3.98,3.91,3.85,3.8,3.74,3.7,3.65,3.61,3.57,3.53,3.5,3.46,3.43,3.4,3.38,3.35,3.34]
[20,75.67,38.53,26.16,19.98,16.27,13.8,12.04,10.73,9.6999999999999993,8.89,8.2200000000000006,7.67,7.2,6.8,6.45,6.15,5.89,5.65,5.45,5.26,5.09,4.9400000000000004,4.8,4.67,4.5599999999999996,4.45,4.3600000000000003,4.2699999999999996,4.1900000000000004,4.1100000000000003,4.04,3.97,3.91,3.85,3.8,3.75,3.71,3.66,3.62,3.59,3.55,3.52,3.49,3.46,3.43,3.42]
[21,76.77,39.090000000000003,26.54,20.27,16.510000000000002,14.01,12.22,10.88,9.84,9.02,8.34,7.78,7.3,6.9,6.55,6.24,5.97,5.74,5.53,5.34,5.17,5.01,4.87,4.74,4.63,4.5199999999999996,4.42,4.33,4.25,4.17,4.0999999999999996,4.03,3.97,3.91,3.86,3.81,3.76,3.72,3.68,3.64,3.61,3.57,3.54,3.51,3.5]
[22,77.88,39.659999999999997,26.93,20.56,16.75,14.21,12.4,11.04,9.99,9.15,8.4600000000000009,7.89,7.41,7,6.64,6.33,6.06,5.82,5.61,5.41,5.24,5.09,4.9400000000000004,4.8099999999999996,4.7,4.59,4.49,4.4000000000000004,4.3099999999999996,4.2300000000000004,4.16,4.09,4.03,3.97,3.92,3.87,3.82,3.78,3.74,3.7,3.66,3.63,3.6,3.59]
[23,79.010000000000005,40.24,27.32,20.86,16.989999999999998,14.42,12.58,11.2,10.130000000000001,9.2799999999999994,8.58,8.01,7.52,7.1,6.74,6.43,6.15,5.91,5.69,5.49,5.32,5.16,5.0199999999999996,4.8899999999999997,4.7699999999999996,4.66,4.5599999999999996,4.46,4.38,4.3,4.2300000000000004,4.16,4.09,4.04,3.98,3.93,3.88,3.84,3.8,3.76,3.72,3.69,3.67]
[24,80.150000000000006,40.82,27.71,21.16,17.239999999999998,14.62,12.76,11.36,10.28,9.42,8.7100000000000009,8.1199999999999992,7.63,7.21,6.84,6.52,6.24,5.99,5.77,5.58,5.4,5.24,5.09,4.96,4.84,4.7300000000000004,4.63,4.53,4.4400000000000004,4.3600000000000003,4.29,4.22,4.16,4.0999999999999996,4.04,3.99,3.95,3.9,3.86,3.82,3.79,3.77]
[25,81.31,41.41,28.11,21.47,17.489999999999998,14.84,12.95,11.53,10.43,9.5500000000000007,8.84,8.24,7.74,7.31,6.94,6.62,6.33,6.08,5.86,5.66,5.48,5.32,5.17,5.03,4.91,4.8,4.7,4.5999999999999996,4.51,4.43,4.3600000000000003,4.29,4.22,4.16,4.1100000000000003,4.0599999999999996,4.01,3.96,3.92,3.88,3.86]
[26,82.49,42.01,28.52,21.78,17.739999999999998,15.05,13.13,11.7,10.58,9.69,8.9700000000000006,8.36,7.85,7.42,7.04,6.71,6.43,6.17,5.95,5.74,5.56,5.4,5.25,5.1100000000000003,4.99,4.87,4.7699999999999996,4.67,4.58,4.5,4.42,4.3499999999999996,4.29,4.2300000000000004,4.17,4.12,4.07,4.03,3.99,3.96]
[27,83.68,42.61,28.93,22.1,18,15.27,13.32,11.87,10.74,9.83,9.1,8.48,7.97,7.53,7.15,6.81,6.52,6.26,6.03,5.83,5.64,5.48,5.33,5.19,5.0599999999999996,4.95,4.84,4.74,4.6500000000000004,4.57,4.49,4.42,4.3600000000000003,4.3,4.24,4.1900000000000004,4.1399999999999997,4.0999999999999996,4.07]
[28,84.88,43.23,29.35,22.42,18.260000000000002,15.49,13.52,12.04,10.89,9.98,9.23,8.61,8.09,7.64,7.25,6.91,6.62,6.36,6.12,5.92,5.73,5.56,5.41,5.27,5.14,5.0199999999999996,4.91,4.82,4.7300000000000004,4.6399999999999997,4.57,4.49,4.43,4.37,4.3099999999999996,4.26,4.21,4.18]
[29,86.11,43.85,29.77,22.74,18.52,15.72,13.71,12.22,11.05,10.119999999999999,9.3699999999999992,8.74,8.1999999999999993,7.75,7.36,7.02,6.72,6.45,6.22,6,5.81,5.64,5.49,5.35,5.22,5.0999999999999996,4.99,4.8899999999999997,4.8,4.72,4.6399999999999997,4.57,4.5,4.4400000000000004,4.38,4.33,4.3]
[30,87.35,44.49,30.2,23.07,18.79,15.94,13.91,12.39,11.21,10.27,9.5,8.86,8.32,7.86,7.47,7.12,6.82,6.55,6.31,6.1,5.9,5.73,5.57,5.43,5.3,5.18,5.07,4.97,4.88,4.79,4.71,4.6399999999999997,4.58,4.51,4.46,4.42]
[31,88.61,45.13,30.64,23.4,19.059999999999999,16.18,14.12,12.57,11.38,10.42,9.64,8.99,8.4499999999999993,7.98,7.58,7.23,6.92,6.65,6.4,6.19,5.99,5.82,5.66,5.51,5.38,5.26,5.15,5.05,4.96,4.87,4.79,4.72,4.6500000000000004,4.59,4.55]
[32,89.88,45.78,31.08,23.74,19.34,16.41,14.32,12.76,11.54,10.57,9.7799999999999994,9.1300000000000008,8.57,8.1,7.69,7.34,7.02,6.75,6.5,6.28,6.08,5.91,5.75,5.6,5.47,5.34,5.23,5.13,5.04,4.95,4.87,4.8,4.7300000000000004,4.6900000000000004]
[33,91.17,46.44,31.53,24.09,19.62,16.649999999999999,14.53,12.94,11.71,10.73,9.93,9.26,8.6999999999999993,8.2200000000000006,7.81,7.45,7.13,6.85,6.6,6.38,6.18,6,5.84,5.69,5.55,5.43,5.32,5.22,5.12,5.03,4.96,4.88,4.83]
[34,92.48,47.11,31.99,24.43,19.91,16.89,14.74,13.13,11.88,10.89,10.07,9.4,8.83,8.34,7.92,7.56,7.24,6.95,6.7,6.48,6.28,6.09,5.93,5.78,5.64,5.52,5.41,5.3,5.21,5.12,5.04,4.9800000000000004]
[35,93.81,47.78,32.450000000000003,24.79,20.190000000000001,17.14,14.96,13.33,12.06,11.05,10.220000000000001,9.5399999999999991,8.9600000000000009,8.4700000000000006,8.0399999999999991,7.67,7.35,7.06,6.81,6.58,6.37,6.19,6.02,5.87,5.74,5.61,5.5,5.39,5.3,5.21,5.14]
[36,95.16,48.47,32.92,25.15,20.49,17.39,15.18,13.52,12.24,11.21,10.38,9.68,9.1,8.6,8.17,7.79,7.46,7.17,6.91,6.68,6.48,6.29,6.12,5.97,5.83,5.71,5.59,5.49,5.39,5.32]
[37,96.52,49.17,33.39,25.51,20.79,17.64,15.4,13.72,12.42,11.38,10.53,9.83,9.23,8.73,8.2899999999999991,7.91,7.58,7.28,7.02,6.79,6.58,6.39,6.22,6.07,5.93,5.8,5.69,5.58,5.5]
[38,97.91,49.88,33.869999999999997,25.88,21.09,17.899999999999999,15.62,13.92,12.6,11.55,10.69,9.9700000000000006,9.3699999999999992,8.86,8.42,8.0299999999999994,7.7,7.4,7.13,6.9,6.69,6.5,6.33,6.17,6.03,5.9,5.79,5.7]
[39,99.31,50.59,34.36,26.25,21.39,18.16,15.85,14.13,12.79,11.72,10.85,10.130000000000001,9.52,9,8.5500000000000007,8.16,7.82,7.52,7.25,7.01,6.8,6.61,6.43,6.28,6.14,6.01,5.91]
[40,100.73,51.32,34.86,26.63,21.71,18.43,16.09,14.34,12.98,11.9,11.01,10.28,9.66,9.14,8.68,8.2899999999999991,7.94,7.64,7.37,7.13,6.91,6.72,6.55,6.39,6.25,6.13]
[41,102.17,52.06,35.36,27.02,22.02,18.7,16.32,14.55,13.17,12.07,11.18,10.44,9.81,9.2799999999999994,8.82,8.42,8.07,7.76,7.49,7.25,7.03,6.84,6.66,6.51,6.38]
[42,103.63,52.8,35.869999999999997,27.41,22.34,18.97,16.57,14.77,13.37,12.26,11.35,10.6,9.9700000000000006,9.43,8.9600000000000009,8.56,8.2100000000000009,7.89,7.62,7.37,7.16,6.96,6.79,6.64]
[43,105.11,53.56,36.39,27.81,22.67,19.25,16.809999999999999,14.99,13.57,12.45,11.53,10.77,10.119999999999999,9.58,9.11,8.6999999999999993,8.34,8.0299999999999994,7.75,7.51,7.29,7.09,6.92]
[44,106.62,54.33,36.92,28.22,23.01,19.54,17.059999999999999,15.21,13.78,12.64,11.71,10.94,10.29,9.73,9.26,8.85,8.49,8.17,7.89,7.64,7.42,7.23]
[45,108.14,55.12,37.450000000000003,28.63,23.35,19.829999999999998,17.32,15.45,13.99,12.84,11.89,11.11,10.45,9.9,9.42,9,8.6300000000000008,8.32,8.0299999999999994,7.78,7.57]
[46,109.69,55.91,38,29.05,23.69,20.13,17.579999999999998,15.68,14.21,13.04,12.08,11.29,10.63,10.06,9.58,9.16,8.7899999999999991,8.4700000000000006,8.19,7.94]
[47,111.25,56.72,38.549999999999997,29.48,24.05,20.43,17.850000000000001,15.93,14.44,13.25,12.28,11.48,10.81,10.24,9.75,9.32,8.9499999999999993,8.6300000000000008,8.35]
[48,112.84,57.54,39.119999999999997,29.92,24.41,20.74,18.13,16.18,14.67,13.46,12.49,11.68,11,10.42,9.92,9.5,9.1199999999999992,8.8000000000000007]
[49,114.46,58.37,39.69,30.36,24.78,21.06,18.420000000000002,16.440000000000001,14.91,13.69,12.7,11.88,11.19,10.61,10.11,9.68,9.31]
[50,116.11,59.23,40.28,30.82,25.16,21.39,18.71,16.71,15.15,13.92,12.92,12.09,11.4,10.81,10.3,9.8699999999999992]
[51,117.79,60.1,40.880000000000003,31.29,25.55,21.73,19.010000000000002,16.98,15.41,14.16,13.15,12.31,11.61,11.02,10.51]
[52,119.51,60.99,41.5,31.78,25.95,22.08,19.329999999999998,17.27,15.68,14.42,13.39,12.55,11.84,11.24]
[53,121.26,61.9,42.14,32.270000000000003,26.37,22.45,19.649999999999999,17.57,15.96,14.68,13.65,12.79,12.08]
[54,123.06,62.84,42.8,32.79,26.8,22.82,19.989999999999998,17.89,16.260000000000002,14.96,13.92,13.05]
[55,124.91,63.81,43.47,33.32,27.25,23.22,20.350000000000001,18.22,16.57,15.26,14.2]
[56,126.82,64.819999999999993,44.18,33.880000000000003,27.72,23.63,20.73,18.57,16.899999999999999,15.57]
[57,128.79,65.86,44.91,34.46,28.22,24.07,21.13,18.940000000000001,17.239999999999998]
[58,130.83000000000001,66.94,45.68,35.07,28.74,24.53,21.55,19.32]
[59,132.96,68.069999999999993,46.48,35.72,29.29,25.03,21.99]
[60,135.19,69.260000000000005,47.33,36.409999999999997,29.88,25.54]
[61,137.53,70.53,48.24,37.14,30.49]
[62,140.03,71.88,49.22,37.9]
[63,142.69999999999999,73.33,50.22]
[64,145.56,74.83]
[65,148.52000000000001]

{"sheet":"x-716","index":66,"n_rows":75,"n_cols":51,"rows_kept":75,"cut":false,"hidden":false,"merged":[]}
["Government Actuary's Department"]
[{"$f":"IF(TITLE=\"> Enter workbook title here\",\"Enter workbook title in Cover sheet\",TITLE)","v":"Local Government Pension Scheme (LGPS) - Consolidated Factor Spreadsheet"}]
[{"$f":"TABLE_FACTOR_TYPE&\" - x-\"&TABLE_SERIES_NUMBER","v":"Added pension - x-716"}]
[]
[]
["Data Item","Factor Table Information"]
["Scheme","LGPS_EW"]
["Section","post 2014"]
["Factor Type","Added pension"]
["Description","Additional pension - Regular monthly contributions - Females with NPA 66 (purchase of additional pension after 1 April 2014)"]
["Gender","Female"]
["Factor Age/Period Definition","Age at first contribution"]
["Section Number",0]
["Series Number",716]
["Table Reference","0-716"]
["Table Reference in Guidance","Table F"]
["Related Factor Guidance Note","LGPS EW Additional Pension post-2014 1 March 2019"]
["Date Factors Issued to Client","2023-09-26"]
["Date Factors Implemented (if known)","2023-10-02"]
["Factor Status","Issued"]
[]
[null,{"$f":"HYPERLINK(\"#'Factor List'!A1\",\"Back to Factor List\")","v":"Back to Factor List"}]
[]
[]
["Age","Arrangement length (years) 1","Arrangement length (years) 2","Arrangement length (years) 3","Arrangement length (years) 4","Arrangement length (years) 5","Arrangement length (years) 6","Arrangement length (years) 7","Arrangement length (years) 8","Arrangement length (years) 9","Arrangement length (years) 10","Arrangement length (years) 11","Arrangement length (years) 12","Arrangement length (years) 13","Arrangement length (years) 14","Arrangement length (years) 15","Arrangement length (years) 16","Arrangement length (years) 17","Arrangement length (years) 18","Arrangement length (years) 19","Arrangement length (years) 20","Arrangement length (years) 21","Arrangement length (years) 22","Arrangement length (years) 23","Arrangement length (years) 24","Arrangement length (years) 25","Arrangement length (years) 26","Arrangement length (years) 27","Arrangement length (years) 28","Arrangement length (years) 29","Arrangement length (years) 30","Arrangement length (years) 31","Arrangement length (years) 32","Arrangement length (years) 33","Arrangement length (years) 34","Arrangement length (years) 35","Arrangement length (years) 36","Arrangement length (years) 37","Arrangement length (years) 38","Arrangement length (years) 39","Arrangement length (years) 40","Arrangement length (years) 41","Arrangement length (years) 42","Arrangement length (years) 43","Arrangement length (years) 44","Arrangement length (years) 45","Arrangement length (years) 46","Arrangement length (years) 47","Arrangement length (years) 48","Arrangement length (years) 49","Arrangement length (years) 50"]
[16,77.44,39.43,26.77,20.440000000000001,16.649999999999999,14.12,12.32,10.97,9.92,9.09,8.4,7.84,7.36,6.95,6.59,6.29,6.02,5.78,5.56,5.37,5.2,5.04,4.9000000000000004,4.7699999999999996,4.6500000000000004,4.54,4.4400000000000004,4.3499999999999996,4.2699999999999996,4.1900000000000004,4.1100000000000003,4.05,3.98,3.92,3.87,3.82,3.77,3.72,3.68,3.64,3.6,3.57,3.53,3.5,3.47,3.45,3.42,3.4,3.37,3.34]
[17,78.59,40.020000000000003,27.17,20.74,16.89,14.33,12.5,11.13,10.07,9.2200000000000006,8.5299999999999994,7.95,7.47,7.05,6.69,6.38,6.1,5.86,5.64,5.45,5.28,5.12,4.97,4.84,4.72,4.6100000000000003,4.51,4.42,4.33,4.25,4.18,4.1100000000000003,4.04,3.98,3.93,3.88,3.83,3.78,3.74,3.7,3.66,3.62,3.59,3.56,3.53,3.5,3.48,3.45,3.44]
[18,79.760000000000005,40.61,27.57,21.05,17.14,14.54,12.69,11.3,10.220000000000001,9.36,8.66,8.07,7.58,7.16,6.79,6.47,6.2,5.95,5.73,5.53,5.35,5.19,5.05,4.91,4.79,4.68,4.58,4.4800000000000004,4.4000000000000004,4.32,4.24,4.17,4.0999999999999996,4.04,3.99,3.93,3.88,3.84,3.79,3.75,3.72,3.68,3.65,3.61,3.58,3.56,3.53,3.52]
[19,80.94,41.21,27.98,21.36,17.399999999999999,14.76,12.88,11.47,10.37,9.5,8.7799999999999994,8.19,7.69,7.26,6.89,6.57,6.29,6.04,5.81,5.61,5.43,5.27,5.12,4.99,4.8600000000000003,4.75,4.6500000000000004,4.55,4.46,4.38,4.3,4.2300000000000004,4.17,4.1100000000000003,4.05,3.99,3.94,3.9,3.85,3.81,3.77,3.74,3.7,3.67,3.64,3.61,3.6]
[20,82.14,41.82,28.39,21.68,17.66,14.98,13.07,11.64,10.53,9.64,8.91,8.31,7.8,7.37,7,6.67,6.38,6.13,5.9,5.7,5.52,5.35,5.2,5.0599999999999996,4.9400000000000004,4.82,4.72,4.62,4.53,4.45,4.37,4.3,4.2300000000000004,4.17,4.1100000000000003,4.0599999999999996,4.01,3.96,3.91,3.87,3.83,3.8,3.76,3.73,3.7,3.68]
[21,83.36,42.44,28.81,22,17.920000000000002,15.2,13.26,11.81,10.68,9.7799999999999994,9.0500000000000007,8.44,7.92,7.48,7.1,6.77,6.48,6.22,5.99,5.78,5.6,5.43,5.28,5.14,5.01,4.9000000000000004,4.79,4.6900000000000004,4.5999999999999996,4.51,4.4400000000000004,4.3600000000000003,4.3,4.2300000000000004,4.17,4.12,4.07,4.0199999999999996,3.97,3.93,3.89,3.86,3.82,3.79,3.77]
[22,84.59,43.07,29.24,22.33,18.18,15.43,13.46,11.98,10.84,9.93,9.18,8.56,8.0399999999999991,7.59,7.21,6.87,6.57,6.31,6.08,5.87,5.68,5.51,5.36,5.22,5.09,4.97,4.8600000000000003,4.76,4.67,4.58,4.5,4.43,4.3600000000000003,4.3,4.24,4.18,4.13,4.08,4.04,4,3.96,3.92,3.88,3.86]
[23,85.84,43.71,29.67,22.66,18.45,15.65,13.66,12.16,11,10.07,9.32,8.69,8.16,7.7,7.31,6.97,6.67,6.41,6.17,5.96,5.77,5.59,5.44,5.29,5.16,5.04,4.93,4.83,4.74,4.6500000000000004,4.57,4.5,4.43,4.3600000000000003,4.3,4.25,4.2,4.1500000000000004,4.0999999999999996,4.0599999999999996,4.0199999999999996,3.98,3.96]
[24,87.11,44.35,30.11,22.99,18.73,15.89,13.86,12.34,11.16,10.220000000000001,9.4600000000000009,8.82,8.2799999999999994,7.82,7.42,7.08,6.77,6.5,6.26,6.05,5.85,5.68,5.52,5.37,5.24,5.12,5.01,4.91,4.8099999999999996,4.72,4.6399999999999997,4.57,4.5,4.43,4.37,4.32,4.26,4.21,4.17,4.12,4.09,4.0599999999999996]
[25,88.39,45.01,30.55,23.33,19,16.12,14.06,12.52,11.33,10.38,9.6,8.9499999999999993,8.4,7.94,7.53,7.18,6.87,6.6,6.36,6.14,5.94,5.76,5.6,5.46,5.32,5.2,5.09,4.9800000000000004,4.8899999999999997,4.8,4.71,4.6399999999999997,4.57,4.5,4.4400000000000004,4.38,4.33,4.28,4.24,4.1900000000000004,4.16]
[26,89.7,45.67,31.01,23.68,19.28,16.36,14.27,12.71,11.5,10.53,9.74,9.08,8.5299999999999994,8.0500000000000007,7.65,7.29,6.98,6.7,6.45,6.23,6.03,5.85,5.69,5.54,5.4,5.28,5.16,5.0599999999999996,4.96,4.87,4.79,4.71,4.6399999999999997,4.57,4.51,4.45,4.4000000000000004,4.3499999999999996,4.3,4.2699999999999996]
[27,91.02,46.35,31.46,24.03,19.57,16.600000000000001,14.48,12.9,11.67,10.69,9.8800000000000008,9.2200000000000006,8.65,8.17,7.76,7.4,7.08,6.8,6.55,6.32,6.12,5.94,5.77,5.62,5.49,5.36,5.24,5.14,5.04,4.95,4.8600000000000003,4.79,4.71,4.6500000000000004,4.58,4.53,4.47,4.42,4.38]
[28,92.36,47.03,31.93,24.38,19.86,16.850000000000001,14.7,13.09,11.84,10.84,10.029999999999999,9.35,8.7799999999999994,8.3000000000000007,7.88,7.51,7.19,6.9,6.65,6.42,6.21,6.03,5.86,5.71,5.57,5.44,5.32,5.22,5.12,5.0199999999999996,4.9400000000000004,4.8600000000000003,4.79,4.72,4.66,4.5999999999999996,4.55,4.5]
[29,93.72,47.72,32.4,24.74,20.149999999999999,17.100000000000001,14.92,13.28,12.02,11,10.18,9.49,8.91,8.42,7.99,7.62,7.29,7,6.75,6.52,6.31,6.12,5.95,5.8,5.65,5.53,5.41,5.3,5.2,5.0999999999999996,5.0199999999999996,4.9400000000000004,4.87,4.8,4.7300000000000004,4.68,4.63]
[30,95.1,48.43,32.880000000000003,25.11,20.45,17.350000000000001,15.14,13.48,12.19,11.17,10.33,9.6300000000000008,9.0500000000000007,8.5500000000000007,8.11,7.74,7.4,7.11,6.85,6.61,6.4,6.21,6.04,5.89,5.74,5.61,5.49,5.38,5.28,5.19,5.0999999999999996,5.0199999999999996,4.95,4.88,4.8099999999999996,4.76]
[31,96.49,49.14,33.36,25.48,20.75,17.600000000000001,15.36,13.68,12.38,11.33,10.48,9.7799999999999994,9.18,8.67,8.23,7.85,7.52,7.22,6.95,6.72,6.5,6.31,6.14,5.98,5.83,5.7,5.58,5.47,5.36,5.27,5.18,5.0999999999999996,5.03,4.96,4.9000000000000004]
[32,97.91,49.86,33.85,25.85,21.06,17.86,15.59,13.88,12.56,11.5,10.64,9.92,9.32,8.8000000000000007,8.36,7.97,7.63,7.33,7.06,6.82,6.6,6.41,6.23,6.07,5.92,5.79,5.67,5.55,5.45,5.36,5.27,5.19,5.1100000000000003,5.05]
[33,99.35,50.59,34.35,26.23,21.37,18.13,15.82,14.09,12.75,11.67,10.8,10.07,9.4600000000000009,8.94,8.48,8.09,7.74,7.44,7.17,6.92,6.7,6.51,6.33,6.17,6.02,5.88,5.76,5.64,5.54,5.44,5.36,5.27,5.21]
[34,100.81,51.34,34.85,26.62,21.68,18.399999999999999,16.05,14.3,12.93,11.85,10.96,10.220000000000001,9.6,9.07,8.61,8.2100000000000009,7.86,7.55,7.28,7.03,6.81,6.61,6.43,6.26,6.11,5.98,5.85,5.74,5.63,5.53,5.45,5.37]
[35,102.28,52.09,35.369999999999997,27.01,22,18.670000000000002,16.29,14.51,13.13,12.02,11.12,10.38,9.75,9.2100000000000009,8.74,8.34,7.98,7.67,7.39,7.14,6.91,6.71,6.53,6.36,6.21,6.07,5.95,5.83,5.73,5.63,5.55]
[36,103.78,52.85,35.89,27.41,22.33,18.940000000000001,16.53,14.72,13.32,12.2,11.29,10.53,9.89,9.35,8.8800000000000008,8.4700000000000006,8.11,7.79,7.5,7.25,7.02,6.82,6.63,6.47,6.31,6.17,6.05,5.93,5.82,5.73]
[37,105.3,53.63,36.409999999999997,27.81,22.66,19.22,16.78,14.94,13.52,12.39,11.46,10.69,10.039999999999999,9.49,9.01,8.6,8.23,7.91,7.62,7.37,7.14,6.93,6.74,6.57,6.42,6.28,6.15,6.03,5.93]
[38,106.84,54.41,36.950000000000003,28.22,22.99,19.510000000000002,17.02,15.17,13.72,12.57,11.63,10.85,10.199999999999999,9.6300000000000008,9.15,8.73,8.36,8.0299999999999994,7.74,7.48,7.25,7.04,6.85,6.68,6.53,6.39,6.26,6.14]
[39,108.4,55.21,37.49,28.64,23.33,19.8,17.28,15.39,13.93,12.76,11.81,11.02,10.35,9.7799999999999994,9.2899999999999991,8.86,8.49,8.16,7.87,7.6,7.37,7.16,6.97,6.79,6.64,6.5,6.37]
[40,109.98,56.02,38.04,29.06,23.67,20.09,17.53,15.62,14.14,12.95,11.99,11.19,10.51,9.93,9.44,9,8.6300000000000008,8.2899999999999991,7.99,7.73,7.49,7.28,7.09,6.91,6.75,6.62]
[41,111.58,56.84,38.6,29.49,24.02,20.39,17.8,15.86,14.35,13.15,12.17,11.36,10.67,10.09,9.59,9.15,8.76,8.42,8.1199999999999992,7.86,7.62,7.4,7.21,7.03,6.88]
[42,113.21,57.67,39.159999999999997,29.92,24.38,20.69,18.059999999999999,16.09,14.57,13.35,12.36,11.53,10.84,10.25,9.74,9.2899999999999991,8.91,8.56,8.26,7.99,7.75,7.53,7.34,7.16]
[43,114.86,58.51,39.74,30.36,24.74,21,18.329999999999998,16.34,14.79,13.55,12.55,11.71,11.01,10.41,9.89,9.4499999999999993,9.0500000000000007,8.7100000000000009,8.4,8.1300000000000008,7.88,7.67,7.47]
[44,116.53,59.37,40.32,30.81,25.11,21.31,18.61,16.59,15.02,13.76,12.74,11.9,11.19,10.58,10.06,9.6,9.1999999999999993,8.85,8.5399999999999991,8.27,8.0299999999999994,7.81]
[45,118.22,60.23,40.92,31.27,25.48,21.63,18.89,16.84,15.25,13.98,12.94,12.09,11.37,10.75,10.220000000000001,9.76,9.36,9.01,8.6999999999999993,8.42,8.17]
[46,119.94,61.11,41.52,31.73,25.86,21.96,19.18,17.100000000000001,15.48,14.2,13.15,12.28,11.55,10.93,10.39,9.93,9.52,9.17,8.85,8.58]
[47,121.68,62.01,42.13,32.200000000000003,26.25,22.29,19.47,17.36,15.73,14.42,13.36,12.48,11.74,11.11,10.57,10.1,9.69,9.34,9.02]
[48,123.45,62.92,42.75,32.68,26.65,22.63,19.77,17.63,15.98,14.65,13.58,12.69,11.94,11.3,10.76,10.28,9.8699999999999992,9.51]
[49,125.25,63.84,43.39,33.17,27.05,22.98,20.079999999999998,17.91,16.23,14.89,13.8,12.9,12.15,11.5,10.95,10.47,10.06]
[50,127.08,64.78,44.04,33.67,27.47,23.34,20.399999999999999,18.2,16.5,15.14,14.04,13.13,12.36,11.71,11.15,10.67]
[51,128.93,65.739999999999995,44.7,34.19,27.89,23.7,20.72,18.489999999999998,16.77,15.4,14.28,13.36,12.59,11.93,11.36]
[52,130.82,66.72,45.37,34.71,28.33,24.08,21.06,18.8,17.05,15.66,14.53,13.6,12.82,12.15]
[53,132.75,67.72,46.06,35.25,28.77,24.47,21.41,19.12,17.350000000000001,15.94,14.8,13.86,13.06]
[54,134.72,68.739999999999995,46.77,35.799999999999997,29.23,24.87,21.77,19.45,17.66,16.23,15.08,14.11]
[55,136.72999999999999,69.790000000000006,47.5,36.369999999999997,29.71,25.29,22.14,19.79,17.98,16.54,15.36]
[56,138.78,70.86,48.25,36.96,30.21,25.72,22.53,20.16,18.32,16.850000000000001]
[57,140.88999999999999,71.97,49.02,37.57,30.72,26.18,22.95,20.54,18.66]
[58,143.06,73.11,49.83,38.21,31.26,26.65,23.38,20.92]
[59,145.30000000000001,74.3,50.66,38.880000000000003,31.83,27.16,23.82]
[60,147.63,75.53,51.54,39.58,32.44,27.66]
[61,150.06,76.83,52.47,40.33,33.04]
[62,152.61000000000001,78.209999999999994,53.46,41.08]
[63,155.32,79.680000000000007,54.45]
[64,158.19999999999999,81.150000000000006]
[65,161.13]

{"sheet":"x-717","index":67,"n_rows":76,"n_cols":52,"rows_kept":76,"cut":false,"hidden":false,"merged":[]}
["Government Actuary's Department"]
[{"$f":"IF(TITLE=\"> Enter workbook title here\",\"Enter workbook title in Cover sheet\",TITLE)","v":"Local Government Pension Scheme (LGPS) - Consolidated Factor Spreadsheet"}]
[{"$f":"TABLE_FACTOR_TYPE&\" - x-\"&TABLE_SERIES_NUMBER","v":"Added pension - x-717"}]
[]
[]
["Data Item","Factor Table Information"]
["Scheme","LGPS_EW"]
["Section","post 2014"]
["Factor Type","Added pension"]
["Description","Additional pension - Regular monthly contributions - Males with NPA 67 (purchase of additional pension after 1 April 2014)"]
["Gender","Male"]
["Factor Age/Period Definition","Age at first contribution"]
["Section Number",0]
["Series Number",717]
["Table Reference","0-717"]
["Table Reference in Guidance","Table G"]
["Related Factor Guidance Note","LGPS EW Additional Pension post-2014 1 March 2019"]
["Date Factors Issued to Client","2023-09-26"]
["Date Factors Implemented (if known)","2023-10-02"]
["Factor Status","Issued"]
[]
[null,{"$f":"HYPERLINK(\"#'Factor List'!A1\",\"Back to Factor List\")","v":"Back to Factor List"}]
[]
[]
["Age","Arrangement length (years) 1","Arrangement length (years) 2","Arrangement length (years) 3","Arrangement length (years) 4","Arrangement length (years) 5","Arrangement length (years) 6","Arrangement length (years) 7","Arrangement length (years) 8","Arrangement length (years) 9","Arrangement length (years) 10","Arrangement length (years) 11","Arrangement length (years) 12","Arrangement length (years) 13","Arrangement length (years) 14","Arrangement length (years) 15","Arrangement length (years) 16","Arrangement length (years) 17","Arrangement length (years) 18","Arrangement length (years) 19","Arrangement length (years) 20","Arrangement length (years) 21","Arrangement length (years) 22","Arrangement length (years) 23","Arrangement length (years) 24","Arrangement length (years) 25","Arrangement length (years) 26","Arrangement length (years) 27","Arrangement length (years) 28","Arrangement length (years) 29","Arrangement length (years) 30","Arrangement length (years) 31","Arrangement length (years) 32","Arrangement length (years) 33","Arrangement length (years) 34","Arrangement length (years) 35","Arrangement length (years) 36","Arrangement length (years) 37","Arrangement length (years) 38","Arrangement length (years) 39","Arrangement length (years) 40","Arrangement length (years) 41","Arrangement length (years) 42","Arrangement length (years) 43","Arrangement length (years) 44","Arrangement length (years) 45","Arrangement length (years) 46","Arrangement length (years) 47","Arrangement length (years) 48","Arrangement length (years) 49","Arrangement length (years) 50","Arrangement length (years) 51"]
[16,68.3,34.78,23.61,18.03,14.69,12.46,10.87,9.68,8.76,8.02,7.42,6.92,6.49,6.13,5.82,5.55,5.31,5.0999999999999996,4.91,4.74,4.59,4.45,4.33,4.21,4.1100000000000003,4.0199999999999996,3.93,3.85,3.77,3.7,3.64,3.58,3.52,3.47,3.42,3.38,3.34,3.3,3.26,3.22,3.19,3.16,3.13,3.1,3.08,3.06,3.03,3.01,2.99,2.98,2.94]
[17,69.290000000000006,35.28,23.95,18.29,14.9,12.64,11.03,9.82,8.8800000000000008,8.1300000000000008,7.52,7.02,6.59,6.22,5.91,5.63,5.39,5.17,4.9800000000000004,4.8099999999999996,4.66,4.5199999999999996,4.3899999999999997,4.28,4.17,4.07,3.99,3.9,3.83,3.76,3.69,3.63,3.58,3.52,3.47,3.43,3.39,3.35,3.31,3.27,3.24,3.21,3.18,3.15,3.13,3.1,3.08,3.06,3.04,3.04]
[18,70.290000000000006,35.79,24.3,18.559999999999999,15.11,12.82,11.19,9.9600000000000009,9.01,8.25,7.63,7.12,6.68,6.31,5.99,5.71,5.47,5.25,5.0599999999999996,4.88,4.7300000000000004,4.59,4.46,4.34,4.2300000000000004,4.13,4.04,3.96,3.88,3.81,3.75,3.69,3.63,3.58,3.53,3.48,3.44,3.4,3.36,3.32,3.29,3.26,3.23,3.2,3.18,3.15,3.13,3.11,3.11]
[19,71.31,36.31,24.65,18.829999999999998,15.33,13.01,11.35,10.11,9.14,8.3699999999999992,7.74,7.22,6.78,6.41,6.08,5.8,5.55,5.33,5.13,4.95,4.8,4.6500000000000004,4.5199999999999996,4.4000000000000004,4.3,4.2,4.0999999999999996,4.0199999999999996,3.94,3.87,3.8,3.74,3.68,3.63,3.58,3.53,3.49,3.45,3.41,3.37,3.34,3.31,3.28,3.25,3.23,3.2,3.18,3.18]
[20,72.34,36.840000000000003,25.01,19.100000000000001,15.56,13.2,11.51,10.25,9.2799999999999994,8.49,7.86,7.33,6.88,6.5,6.17,5.88,5.63,5.4,5.21,5.03,4.87,4.72,4.59,4.47,4.3600000000000003,4.26,4.17,4.08,4,3.93,3.86,3.8,3.74,3.68,3.63,3.59,3.54,3.5,3.46,3.43,3.39,3.36,3.33,3.31,3.28,3.26,3.25]
[21,73.38,37.369999999999997,25.37,19.37,15.78,13.39,11.68,10.4,9.41,8.6199999999999992,7.97,7.43,6.98,6.59,6.26,5.97,5.71,5.48,5.28,5.0999999999999996,4.9400000000000004,4.79,4.66,4.53,4.42,4.32,4.2300000000000004,4.1399999999999997,4.0599999999999996,3.99,3.92,3.86,3.8,3.74,3.69,3.64,3.6,3.56,3.52,3.48,3.45,3.42,3.39,3.36,3.33,3.33]
[22,74.44,37.909999999999997,25.74,19.649999999999999,16.010000000000002,13.58,11.85,10.55,9.5500000000000007,8.74,8.09,7.54,7.08,6.69,6.35,6.05,5.79,5.56,5.36,5.18,5.01,4.8600000000000003,4.7300000000000004,4.5999999999999996,4.49,4.3899999999999997,4.29,4.2,4.12,4.05,3.98,3.91,3.85,3.8,3.75,3.7,3.65,3.61,3.57,3.54,3.5,3.47,3.44,3.42,3.4]
[23,75.510000000000005,38.450000000000003,26.11,19.940000000000001,16.239999999999998,13.78,12.02,10.71,9.68,8.8699999999999992,8.1999999999999993,7.65,7.19,6.79,6.44,6.14,5.88,5.65,5.44,5.25,5.08,4.93,4.8,4.67,4.5599999999999996,4.45,4.3499999999999996,4.2699999999999996,4.18,4.1100000000000003,4.04,3.97,3.91,3.86,3.8,3.76,3.71,3.67,3.63,3.59,3.56,3.53,3.5,3.49]
[24,76.599999999999994,39.01,26.48,20.23,16.47,13.98,12.19,10.86,9.83,9,8.32,7.76,7.29,6.89,6.54,6.23,5.97,5.73,5.52,5.33,5.16,5.01,4.87,4.74,4.62,4.5199999999999996,4.42,4.33,4.25,4.17,4.0999999999999996,4.03,3.97,3.92,3.86,3.82,3.77,3.73,3.69,3.65,3.62,3.59,3.57]
[25,77.7,39.57,26.86,20.52,16.71,14.18,12.37,11.02,9.9700000000000006,9.1300000000000008,8.44,7.88,7.4,6.99,6.63,6.32,6.05,5.81,5.6,5.41,5.24,5.08,4.9400000000000004,4.8099999999999996,4.6900000000000004,4.59,4.49,4.4000000000000004,4.3099999999999996,4.2300000000000004,4.16,4.0999999999999996,4.04,3.98,3.93,3.88,3.83,3.79,3.75,3.71,3.68,3.66]
[26,78.819999999999993,40.14,27.25,20.81,16.95,14.38,12.55,11.18,10.11,9.26,8.57,7.99,7.5,7.09,6.73,6.42,6.14,5.9,5.68,5.49,5.31,5.16,5.01,4.88,4.76,4.6500000000000004,4.5599999999999996,4.46,4.38,4.3,4.2300000000000004,4.16,4.0999999999999996,4.04,3.99,3.94,3.89,3.85,3.81,3.77,3.76]
[27,79.95,40.72,27.64,21.11,17.2,14.59,12.73,11.34,10.26,9.4,8.69,8.11,7.61,7.19,6.83,6.51,6.23,5.99,5.77,5.57,5.39,5.23,5.09,4.96,4.84,4.7300000000000004,4.62,4.53,4.45,4.37,4.29,4.2300000000000004,4.16,4.1100000000000003,4.05,4,3.96,3.91,3.88,3.85]
[28,81.099999999999994,41.3,28.04,21.42,17.45,14.8,12.92,11.5,10.41,9.5299999999999994,8.82,8.23,7.72,7.3,6.93,6.61,6.32,6.07,5.85,5.65,5.47,5.31,5.16,5.03,4.91,4.8,4.7,4.5999999999999996,4.5199999999999996,4.4400000000000004,4.3600000000000003,4.29,4.2300000000000004,4.17,4.12,4.07,4.0199999999999996,3.98,3.96]
[29,82.26,41.89,28.44,21.72,17.7,15.01,13.1,11.67,10.56,9.67,8.9499999999999993,8.35,7.84,7.4,7.03,6.7,6.42,6.16,5.94,5.74,5.56,5.39,5.24,5.1100000000000003,4.9800000000000004,4.87,4.7699999999999996,4.67,4.59,4.51,4.43,4.3600000000000003,4.3,4.24,4.1900000000000004,4.1399999999999997,4.09,4.0599999999999996]
[30,83.44,42.5,28.85,22.04,17.95,15.23,13.29,11.84,10.71,9.81,9.08,8.4700000000000006,7.95,7.51,7.13,6.8,6.51,6.26,6.03,5.82,5.64,5.47,5.32,5.19,5.0599999999999996,4.95,4.84,4.75,4.66,4.58,4.5,4.43,4.37,4.3099999999999996,4.26,4.21,4.18]
[31,84.64,43.11,29.27,22.35,18.21,15.45,13.48,12.01,10.87,9.9499999999999993,9.2100000000000009,8.59,8.07,7.62,7.24,6.9,6.61,6.35,6.12,5.91,5.72,5.56,5.4,5.27,5.14,5.0199999999999996,4.92,4.82,4.7300000000000004,4.6500000000000004,4.58,4.51,4.4400000000000004,4.3899999999999997,4.33,4.3]
[32,85.85,43.72,29.69,22.68,18.47,15.67,13.68,12.18,11.03,10.1,9.34,8.7200000000000006,8.19,7.74,7.35,7.01,6.71,6.44,6.21,6,5.81,5.64,5.49,5.35,5.22,5.0999999999999996,5,4.9000000000000004,4.8099999999999996,4.7300000000000004,4.6500000000000004,4.58,4.5199999999999996,4.46,4.42]
[33,87.08,44.35,30.11,23,18.739999999999998,15.9,13.88,12.36,11.19,10.25,9.48,8.85,8.31,7.85,7.46,7.11,6.81,6.54,6.3,6.09,5.9,5.73,5.57,5.43,5.3,5.19,5.08,4.9800000000000004,4.8899999999999997,4.8099999999999996,4.7300000000000004,4.66,4.5999999999999996,4.5599999999999996]
[34,88.32,44.98,30.55,23.33,19.010000000000002,16.13,14.08,12.54,11.35,10.4,9.6199999999999992,8.98,8.43,7.97,7.57,7.22,6.91,6.64,6.4,6.19,5.99,5.82,5.66,5.52,5.39,5.27,5.16,5.0599999999999996,4.97,4.8899999999999997,4.8099999999999996,4.75,4.7]
[35,89.58,45.63,30.98,23.67,19.28,16.36,14.28,12.72,11.51,10.55,9.76,9.11,8.56,8.09,7.68,7.33,7.02,6.74,6.5,6.28,6.09,5.91,5.75,5.61,5.48,5.36,5.25,5.15,5.0599999999999996,4.9800000000000004,4.9000000000000004,4.8499999999999996]
[36,90.86,46.28,31.43,24.01,19.559999999999999,16.600000000000001,14.49,12.91,11.68,10.7,9.91,9.24,8.68,8.2100000000000009,7.8,7.44,7.12,6.85,6.6,6.38,6.18,6.01,5.84,5.7,5.57,5.45,5.34,5.24,5.15,5.0599999999999996,5]
[37,92.15,46.94,31.88,24.35,19.84,16.84,14.7,13.1,11.85,10.86,10.050000000000001,9.3800000000000008,8.81,8.33,7.91,7.55,7.23,6.95,6.7,6.48,6.28,6.1,5.94,5.79,5.66,5.54,5.43,5.33,5.24,5.17]
[38,93.47,47.61,32.340000000000003,24.71,20.13,17.09,14.91,13.29,12.03,11.02,10.199999999999999,9.52,8.9499999999999993,8.4600000000000009,8.0399999999999991,7.67,7.35,7.06,6.81,6.59,6.38,6.2,6.04,5.89,5.76,5.64,5.53,5.43,5.35]
[39,94.8,48.29,32.799999999999997,25.06,20.420000000000002,17.329999999999998,15.13,13.48,12.21,11.19,10.36,9.66,9.08,8.59,8.16,7.79,7.46,7.17,6.92,6.69,6.49,6.31,6.14,5.99,5.86,5.74,5.63,5.54]
[40,96.14,48.98,33.270000000000003,25.42,20.72,17.59,15.35,13.68,12.39,11.35,10.51,9.81,9.2200000000000006,8.7200000000000006,8.2899999999999991,7.91,7.58,7.29,7.03,6.8,6.6,6.41,6.25,6.1,5.96,5.84,5.75]
[41,97.51,49.68,33.75,25.79,21.02,17.84,15.58,13.89,12.57,11.52,10.67,9.9600000000000009,9.36,8.86,8.42,8.0399999999999991,7.7,7.41,7.15,6.92,6.71,6.53,6.36,6.21,6.07,5.97]
[42,98.89,50.39,34.229999999999997,26.16,21.32,18.100000000000001,15.81,14.09,12.76,11.7,10.83,10.11,9.51,9,8.5500000000000007,8.17,7.83,7.53,7.27,7.04,6.83,6.64,6.48,6.33,6.2]
[43,100.29,51.11,34.72,26.54,21.63,18.37,16.04,14.3,12.95,11.88,11,10.27,9.66,9.14,8.69,8.3000000000000007,7.96,7.66,7.4,7.16,6.95,6.76,6.6,6.46]
[44,101.71,51.84,35.22,26.92,21.95,18.64,16.28,14.52,13.15,12.06,11.17,10.43,9.81,9.2899999999999991,8.83,8.44,8.1,7.79,7.53,7.29,7.08,6.89,6.74]
[45,103.15,52.57,35.729999999999997,27.31,22.27,18.91,16.52,14.73,13.35,12.24,11.34,10.6,9.9700000000000006,9.44,8.98,8.58,8.24,7.93,7.66,7.43,7.21,7.04]
[46,104.61,53.32,36.24,27.71,22.6,19.190000000000001,16.77,14.96,13.55,12.44,11.53,10.77,10.14,9.6,9.1300000000000008,8.73,8.3800000000000008,8.08,7.81,7.57,7.37]
[47,106.09,54.09,36.76,28.11,22.93,19.48,17.03,15.19,13.77,12.63,11.71,10.95,10.31,9.76,9.2899999999999991,8.89,8.5399999999999991,8.23,7.96,7.73]
[48,107.59,54.86,37.299999999999997,28.52,23.27,19.78,17.29,15.43,13.99,12.84,11.9,11.13,10.48,9.93,9.4600000000000009,9.0500000000000007,8.6999999999999993,8.39,8.1300000000000008]
[49,109.11,55.65,37.840000000000003,28.95,23.62,20.079999999999998,17.55,15.67,14.21,13.05,12.1,11.32,10.67,10.11,9.64,9.23,8.8699999999999992,8.57]
[50,110.66,56.45,38.39,29.38,23.98,20.39,17.829999999999998,15.92,14.44,13.27,12.31,11.52,10.86,10.3,9.82,9.41,9.06]
[51,112.24,57.27,38.96,29.82,24.34,20.71,18.12,16.18,14.69,13.5,12.53,11.73,11.06,10.5,10.02,9.61]
[52,113.85,58.1,39.54,30.27,24.72,21.04,18.41,16.45,14.94,13.73,12.76,11.95,11.28,10.71,10.23]
[53,115.49,58.96,40.130000000000003,30.74,25.11,21.38,18.72,16.73,15.2,13.98,13,12.18,11.5,10.93]
[54,117.17,59.84,40.75,31.22,25.52,21.73,19.04,17.03,15.48,14.25,13.25,12.43,11.75]
[55,118.9,60.74,41.38,31.72,25.94,22.1,19.37,17.34,15.77,14.53,13.52,12.69]
[56,120.67,61.68,42.04,32.24,26.38,22.49,19.72,17.670000000000002,16.079999999999998,14.82,13.8]
[57,122.5,62.64,42.72,32.78,26.84,22.9,20.100000000000001,18.010000000000002,16.41,15.13]
[58,124.4,63.65,43.43,33.35,27.32,23.33,20.49,18.38,16.75]
[59,126.36,64.7,44.18,33.950000000000003,27.84,23.79,20.92,18.77]
[60,128.41999999999999,65.8,44.96,34.58,28.39,24.28,21.36]
[61,130.58000000000001,66.959999999999994,45.8,35.270000000000003,28.98,24.79]
[62,132.87,68.2,46.7,36,29.59]
[63,135.33000000000001,69.55,47.68,36.76]
[64,137.97999999999999,71,48.68]
[65,140.84,72.489999999999995]
[66,143.80000000000001]

{"sheet":"x-718","index":68,"n_rows":76,"n_cols":52,"rows_kept":76,"cut":false,"hidden":false,"merged":[]}
["Government Actuary's Department"]
[{"$f":"IF(TITLE=\"> Enter workbook title here\",\"Enter workbook title in Cover sheet\",TITLE)","v":"Local Government Pension Scheme (LGPS) - Consolidated Factor Spreadsheet"}]
[{"$f":"TABLE_FACTOR_TYPE&\" - x-\"&TABLE_SERIES_NUMBER","v":"Added pension - x-718"}]
[]
[]
["Data Item","Factor Table Information"]
["Scheme","LGPS_EW"]
["Section","post 2014"]
["Factor Type","Added pension"]
["Description","Additional pension - Regular monthly contributions - Females with NPA 67 (purchase of additional pension after 1 April 2014)"]
["Gender","Female"]
["Factor Age/Period Definition","Age at first contribution"]
["Section Number",0]
["Series Number",718]
["Table Reference","0-718"]
["Table Reference in Guidance","Table H"]
["Related Factor Guidance Note","LGPS EW Additional Pension post-2014 1 March 2019"]
["Date Factors Issued to Client","2023-09-26"]
["Date Factors Implemented (if known)","2023-10-02"]
["Factor Status","Issued"]
[]
[null,{"$f":"HYPERLINK(\"#'Factor List'!A1\",\"Back to Factor List\")","v":"Back to Factor List"}]
[]
[]
["Age","Arrangement length (years) 1","Arrangement length (years) 2","Arrangement length (years) 3","Arrangement length (years) 4","Arrangement length (years) 5","Arrangement length (years) 6","Arrangement length (years) 7","Arrangement length (years) 8","Arrangement length (years) 9","Arrangement length (years) 10","Arrangement length (years) 11","Arrangement length (years) 12","Arrangement length (years) 13","Arrangement length (years) 14","Arrangement length (years) 15","Arrangement length (years) 16","Arrangement length (years) 17","Arrangement length (years) 18","Arrangement length (years) 19","Arrangement length (years) 20","Arrangement length (years) 21","Arrangement length (years) 22","Arrangement length (years) 23","Arrangement length (years) 24","Arrangement length (years) 25","Arrangement length (years) 26","Arrangement length (years) 27","Arrangement length (years) 28","Arrangement length (years) 29","Arrangement length (years) 30","Arrangement length (years) 31","Arrangement length (years) 32","Arrangement length (years) 33","Arrangement length (years) 34","Arrangement length (years) 35","Arrangement length (years) 36","Arrangement length (years) 37","Arrangement length (years) 38","Arrangement length (years) 39","Arrangement length (years) 40","Arrangement length (years) 41","Arrangement length (years) 42","Arrangement length (years) 43","Arrangement length (years) 44","Arrangement length (years) 45","Arrangement length (years) 46","Arrangement length (years) 47","Arrangement length (years) 48","Arrangement length (years) 49","Arrangement length (years) 50","Arrangement length (years) 51"]
[16,74.19,37.78,25.65,19.579999999999998,15.95,13.53,11.8,10.51,9.51,8.7100000000000009,8.0500000000000007,7.51,7.05,6.66,6.32,6.02,5.76,5.53,5.33,5.14,4.9800000000000004,4.83,4.6900000000000004,4.57,4.46,4.3499999999999996,4.26,4.17,4.09,4.01,3.94,3.88,3.82,3.76,3.71,3.66,3.61,3.57,3.53,3.49,3.45,3.42,3.39,3.36,3.33,3.3,3.28,3.25,3.23,3.21,3.18]
[17,75.290000000000006,38.340000000000003,26.02,19.87,16.18,13.73,11.98,10.67,9.65,8.83,8.17,7.62,7.15,6.76,6.41,6.11,5.85,5.62,5.41,5.22,5.05,4.9000000000000004,4.76,4.6399999999999997,4.5199999999999996,4.42,4.32,4.2300000000000004,4.1500000000000004,4.07,4,3.94,3.87,3.82,3.76,3.71,3.67,3.62,3.58,3.54,3.51,3.47,3.44,3.41,3.38,3.35,3.33,3.31,3.28,3.27]
[18,76.400000000000006,38.9,26.41,20.170000000000002,16.420000000000002,13.93,12.15,10.82,9.7899999999999991,8.9600000000000009,8.2899999999999991,7.73,7.26,6.86,6.51,6.2,5.94,5.7,5.49,5.3,5.13,4.97,4.84,4.71,4.59,4.4800000000000004,4.3899999999999997,4.3,4.21,4.13,4.0599999999999996,3.99,3.93,3.87,3.82,3.77,3.72,3.68,3.64,3.6,3.56,3.52,3.49,3.46,3.43,3.41,3.38,3.36,3.35]
[19,77.53,39.479999999999997,26.8,20.46,16.670000000000002,14.14,12.33,10.98,9.93,9.1,8.41,7.85,7.37,6.96,6.6,6.29,6.02,5.78,5.57,5.38,5.21,5.05,4.91,4.78,4.66,4.55,4.45,4.3600000000000003,4.2699999999999996,4.2,4.12,4.05,3.99,3.93,3.88,3.83,3.78,3.73,3.69,3.65,3.61,3.58,3.55,3.52,3.49,3.46,3.44,3.42]
[20,78.680000000000007,40.06,27.2,20.77,16.91,14.35,12.52,11.15,10.08,9.23,8.5399999999999991,7.96,7.48,7.06,6.7,6.39,6.11,5.87,5.65,5.46,5.28,5.12,4.9800000000000004,4.8499999999999996,4.7300000000000004,4.62,4.5199999999999996,4.43,4.34,4.26,4.1900000000000004,4.12,4.05,3.99,3.94,3.89,3.84,3.79,3.75,3.71,3.67,3.64,3.6,3.57,3.54,3.52,3.5]
[21,79.84,40.65,27.6,21.07,17.16,14.56,12.7,11.31,10.23,9.3699999999999992,8.67,8.08,7.59,7.16,6.8,6.48,6.2,5.96,5.74,5.54,5.36,5.2,5.05,4.92,4.8,4.6900000000000004,4.59,4.49,4.4000000000000004,4.32,4.25,4.18,4.1100000000000003,4.05,4,3.94,3.9,3.85,3.81,3.77,3.73,3.69,3.66,3.63,3.6,3.59]
[22,81.010000000000005,41.25,28,21.38,17.420000000000002,14.77,12.89,11.48,10.38,9.51,8.7899999999999991,8.1999999999999993,7.7,7.27,6.9,6.58,6.3,6.05,5.82,5.62,5.44,5.28,5.13,5,4.87,4.76,4.66,4.5599999999999996,4.47,4.3899999999999997,4.3099999999999996,4.24,4.18,4.12,4.0599999999999996,4.01,3.96,3.91,3.87,3.83,3.79,3.75,3.72,3.69,3.67]
[23,82.21,41.86,28.42,21.7,17.670000000000002,14.99,13.08,11.65,10.54,9.65,8.92,8.32,7.81,7.38,7,6.68,6.39,6.14,5.91,5.71,5.52,5.36,5.21,5.07,4.95,4.83,4.7300000000000004,4.63,4.54,4.46,4.38,4.3099999999999996,4.24,4.18,4.12,4.07,4.0199999999999996,3.97,3.93,3.89,3.85,3.81,3.78,3.76]
[24,83.42,42.47,28.83,22.02,17.93,15.21,13.27,11.82,10.69,9.7899999999999991,9.06,8.44,7.93,7.49,7.11,6.78,6.48,6.23,6,5.79,5.61,5.44,5.29,5.15,5.0199999999999996,4.9000000000000004,4.8,4.7,4.6100000000000003,4.5199999999999996,4.45,4.37,4.3099999999999996,4.24,4.1900000000000004,4.13,4.08,4.03,3.99,3.95,3.91,3.88,3.85]
[25,84.64,43.1,29.26,22.34,18.2,15.44,13.47,11.99,10.85,9.93,9.19,8.57,8.0500000000000007,7.6,7.21,6.88,6.58,6.32,6.09,5.88,5.69,5.52,5.36,5.22,5.0999999999999996,4.9800000000000004,4.87,4.7699999999999996,4.68,4.59,4.51,4.4400000000000004,4.37,4.3099999999999996,4.25,4.2,4.1500000000000004,4.0999999999999996,4.0599999999999996,4.01,3.98,3.95]
[26,85.88,43.73,29.69,22.67,18.46,15.66,13.67,12.17,11.01,10.08,9.32,8.6999999999999993,8.17,7.71,7.32,6.98,6.68,6.41,6.18,5.97,5.77,5.6,5.45,5.3,5.17,5.05,4.9400000000000004,4.84,4.75,4.66,4.58,4.51,4.4400000000000004,4.38,4.32,4.26,4.21,4.17,4.12,4.08,4.05]
[27,87.14,44.37,30.12,23,18.739999999999998,15.89,13.87,12.35,11.17,10.23,9.4600000000000009,8.82,8.2899999999999991,7.83,7.43,7.08,6.78,6.51,6.27,6.05,5.86,5.69,5.53,5.38,5.25,5.13,5.0199999999999996,4.92,4.82,4.74,4.66,4.58,4.51,4.45,4.3899999999999997,4.33,4.28,4.2300000000000004,4.1900000000000004,4.16]
[28,88.42,45.03,30.57,23.34,19.010000000000002,16.13,14.07,12.53,11.34,10.38,9.6,8.9600000000000009,8.41,7.94,7.54,7.19,6.88,6.61,6.36,6.15,5.95,5.77,5.61,5.47,5.33,5.21,5.0999999999999996,4.99,4.9000000000000004,4.8099999999999996,4.7300000000000004,4.6500000000000004,4.58,4.5199999999999996,4.46,4.4000000000000004,4.3499999999999996,4.3,4.2699999999999996]
[29,89.72,45.69,31.02,23.69,19.29,16.37,14.28,12.72,11.5,10.53,9.74,9.09,8.5299999999999994,8.06,7.65,7.3,6.98,6.71,6.46,6.24,6.04,5.86,5.7,5.55,5.41,5.29,5.18,5.07,4.9800000000000004,4.8899999999999997,4.8,4.7300000000000004,4.66,4.59,4.53,4.4800000000000004,4.43,4.3899999999999997]
[30,91.03,46.36,31.47,24.03,19.57,16.61,14.49,12.9,11.67,10.69,9.89,9.2200000000000006,8.66,8.18,7.77,7.4,7.09,6.81,6.56,6.33,6.13,5.95,5.78,5.63,5.5,5.37,5.26,5.15,5.05,4.96,4.88,4.8,4.7300000000000004,4.67,4.6100000000000003,4.55,4.51]
[31,92.36,47.03,31.93,24.39,19.86,16.850000000000001,14.7,13.09,11.85,10.85,10.039999999999999,9.36,8.7899999999999991,8.3000000000000007,7.88,7.52,7.19,6.91,6.66,6.43,6.22,6.04,5.87,5.72,5.58,5.46,5.34,5.23,5.13,5.04,4.96,4.88,4.8099999999999996,4.75,4.6900000000000004,4.6399999999999997]
[32,93.71,47.72,32.4,24.74,20.149999999999999,17.100000000000001,14.92,13.29,12.02,11.01,10.18,9.5,8.92,8.43,8,7.63,7.3,7.01,6.76,6.53,6.32,6.13,5.96,5.81,5.67,5.54,5.42,5.32,5.22,5.13,5.04,4.96,4.8899999999999997,4.83,4.7699999999999996]
[33,95.08,48.42,32.869999999999997,25.11,20.45,17.350000000000001,15.14,13.48,12.2,11.17,10.34,9.64,9.0500000000000007,8.5500000000000007,8.1199999999999992,7.74,7.41,7.12,6.86,6.63,6.42,6.23,6.06,5.9,5.76,5.63,5.51,5.4,5.3,5.21,5.13,5.05,4.9800000000000004,4.92]
[34,96.47,49.13,33.35,25.47,20.75,17.600000000000001,15.36,13.68,12.38,11.34,10.49,9.7799999999999994,9.19,8.68,8.24,7.86,7.52,7.23,6.96,6.73,6.52,6.32,6.15,5.99,5.85,5.72,5.6,5.49,5.39,5.3,5.21,5.13,5.07]
[35,97.88,49.85,33.840000000000003,25.85,21.05,17.86,15.59,13.88,12.56,11.51,10.65,9.93,9.33,8.81,8.3699999999999992,7.98,7.64,7.34,7.07,6.83,6.62,6.42,6.25,6.09,5.94,5.81,5.69,5.58,5.48,5.39,5.3,5.23]
[36,99.3,50.57,34.340000000000003,26.23,21.36,18.13,15.82,14.09,12.75,11.68,10.8,10.08,9.4700000000000006,8.94,8.49,8.1,7.76,7.45,7.18,6.94,6.72,6.53,6.35,6.19,6.04,5.91,5.79,5.68,5.57,5.48,5.4]
[37,100.75,51.31,34.840000000000003,26.61,21.68,18.39,16.05,14.3,12.94,11.85,10.97,10.23,9.61,9.08,8.6199999999999992,8.2200000000000006,7.88,7.57,7.29,7.05,6.83,6.63,6.45,6.29,6.14,6.01,5.88,5.77,5.67,5.58]
[38,102.21,52.06,35.35,27,21.99,18.66,16.29,14.51,13.13,12.03,11.13,10.38,9.75,9.2200000000000006,8.75,8.35,8,7.68,7.41,7.16,6.94,6.74,6.56,6.39,6.24,6.11,5.99,5.87,5.78]
[39,103.69,52.81,35.86,27.39,22.32,18.940000000000001,16.53,14.72,13.32,12.21,11.3,10.54,9.9,9.36,8.89,8.48,8.1199999999999992,7.81,7.53,7.27,7.05,6.85,6.67,6.5,6.35,6.21,6.09,5.99]
[40,105.2,53.58,36.39,27.79,22.65,19.22,16.77,14.94,13.52,12.39,11.47,10.7,10.050000000000001,9.5,9.0299999999999994,8.61,8.25,7.93,7.65,7.39,7.17,6.96,6.78,6.61,6.46,6.33,6.21]
[41,106.72,54.36,36.92,28.2,22.98,19.5,17.02,15.17,13.73,12.58,11.64,10.86,10.210000000000001,9.65,9.17,8.75,8.3800000000000008,8.06,7.77,7.51,7.29,7.08,6.89,6.73,6.58,6.45]
[42,108.27,55.15,37.46,28.61,23.32,19.79,17.27,15.39,13.93,12.77,11.82,11.03,10.37,9.8000000000000007,9.31,8.89,8.52,8.19,7.9,7.64,7.41,7.2,7.02,6.85,6.7]
[43,109.83,55.95,38,29.03,23.66,20.079999999999998,17.53,15.62,14.14,12.96,12,11.2,10.53,9.9600000000000009,9.4600000000000009,9.0299999999999994,8.66,8.33,8.0299999999999994,7.77,7.54,7.33,7.14,6.98]
[44,111.42,56.76,38.56,29.46,24.01,20.38,17.79,15.86,14.36,13.16,12.19,11.38,10.69,10.11,9.61,9.18,8.8000000000000007,8.4700000000000006,8.17,7.91,7.67,7.46,7.28]
[45,113.03,57.59,39.119999999999997,29.89,24.36,20.68,18.059999999999999,16.100000000000001,14.58,13.36,12.38,11.56,10.87,10.28,9.77,9.33,8.9499999999999993,8.61,8.31,8.0500000000000007,7.81,7.61]
[46,114.66,58.42,39.69,30.33,24.72,20.99,18.329999999999998,16.34,14.8,13.57,12.57,11.74,11.04,10.45,9.94,9.49,9.1,8.76,8.4600000000000009,8.1999999999999993,7.96]
[47,116.31,59.27,40.270000000000003,30.78,25.09,21.31,18.61,16.600000000000001,15.03,13.79,12.77,11.93,11.22,10.62,10.11,9.66,9.27,8.92,8.6199999999999992,8.35]
[48,117.99,60.13,40.86,31.24,25.47,21.63,18.899999999999999,16.850000000000001,15.27,14.01,12.98,12.13,11.41,10.8,10.28,9.83,9.44,9.09,8.7899999999999991]
[49,119.69,61.01,41.46,31.7,25.85,21.96,19.190000000000001,17.12,15.51,14.23,13.19,12.33,11.61,10.99,10.46,10.01,9.61,9.26]
[50,121.41,61.9,42.07,32.17,26.24,22.3,19.489999999999998,17.39,15.76,14.47,13.41,12.54,11.81,11.19,10.66,10.199999999999999,9.8000000000000007]
[51,123.17,62.8,42.7,32.659999999999997,26.64,22.64,19.8,17.670000000000002,16.02,14.71,13.64,12.76,12.02,11.4,10.86,10.39]
[52,124.95,63.72,43.33,33.15,27.05,23,20.11,17.96,16.29,14.96,13.88,12.99,12.25,11.61,11.07]
[53,126.77,64.67,43.98,33.659999999999997,27.48,23.37,20.440000000000001,18.260000000000002,16.57,15.22,14.13,13.23,12.48,11.83]
[54,128.62,65.63,44.65,34.18,27.91,23.74,20.78,18.57,16.86,15.5,14.4,13.49,12.72]
[55,130.5,66.61,45.33,34.72,28.36,24.14,21.13,18.89,17.16,15.79,14.68,13.74]
[56,132.41999999999999,67.61,46.04,35.270000000000003,28.82,24.54,21.5,19.23,17.48,16.09,14.95]
[57,134.4,68.650000000000006,46.76,35.840000000000003,29.31,24.97,21.89,19.59,17.82,16.399999999999999]
[58,136.41999999999999,69.72,47.51,36.44,29.81,25.42,22.3,19.97,18.16]
[59,138.51,70.819999999999993,48.3,37.06,30.35,25.89,22.73,20.350000000000001]
[60,140.68,71.98,49.12,37.72,30.91,26.4,23.16]
[61,142.93,73.180000000000007,49.98,38.42,31.51,26.9]
[62,145.29,74.459999999999994,50.9,39.159999999999997,32.11]
[63,147.79,75.819999999999993,51.88,39.9]
[64,150.46,77.27,52.87]
[65,153.32,78.739999999999995]
[66,156.22999999999999]

{"sheet":"x-719","index":69,"n_rows":77,"n_cols":53,"rows_kept":77,"cut":false,"hidden":false,"merged":[]}
["Government Actuary's Department"]
[{"$f":"IF(TITLE=\"> Enter workbook title here\",\"Enter workbook title in Cover sheet\",TITLE)","v":"Local Government Pension Scheme (LGPS) - Consolidated Factor Spreadsheet"}]
[{"$f":"TABLE_FACTOR_TYPE&\" - x-\"&TABLE_SERIES_NUMBER","v":"Added pension - x-719"}]
[]
[]
["Data Item","Factor Table Information"]
["Scheme","LGPS_EW"]
["Section","post 2014"]
["Factor Type","Added pension"]
["Description","Additional pension - Regular monthly contributions - Males with NPA 68 (purchase of additional pension after 1 April 2014)"]
["Gender","Male"]
["Factor Age/Period Definition","Age at first contribution"]
["Section Number",0]
["Series Number",719]
["Table Reference","0-719"]
["Table Reference in Guidance","Table I"]
["Related Factor Guidance Note","LGPS EW Additional Pension post-2014 1 March 2019"]
["Date Factors Issued to Client","2023-09-26"]
["Date Factors Implemented (if known)","2023-10-02"]
["Factor Status","Issued"]
[]
[null,{"$f":"HYPERLINK(\"#'Factor List'!A1\",\"Back to Factor List\")","v":"Back to Factor List"}]
[]
[]
["Age","Arrangement length (years) 1","Arrangement length (years) 2","Arrangement length (years) 3","Arrangement length (years) 4","Arrangement length (years) 5","Arrangement length (years) 6","Arrangement length (years) 7","Arrangement length (years) 8","Arrangement length (years) 9","Arrangement length (years) 10","Arrangement length (years) 11","Arrangement length (years) 12","Arrangement length (years) 13","Arrangement length (years) 14","Arrangement length (years) 15","Arrangement length (years) 16","Arrangement length (years) 17","Arrangement length (years) 18","Arrangement length (years) 19","Arrangement length (years) 20","Arrangement length (years) 21","Arrangement length (years) 22","Arrangement length (years) 23","Arrangement length (years) 24","Arrangement length (years) 25","Arrangement length (years) 26","Arrangement length (years) 27","Arrangement length (years) 28","Arrangement length (years) 29","Arrangement length (years) 30","Arrangement length (years) 31","Arrangement length (years) 32","Arrangement length (years) 33","Arrangement length (years) 34","Arrangement length (years) 35","Arrangement length (years) 36","Arrangement length (years) 37","Arrangement length (years) 38","Arrangement length (years) 39","Arrangement length (years) 40","Arrangement length (years) 41","Arrangement length (years) 42","Arrangement length (years) 43","Arrangement length (years) 44","Arrangement length (years) 45","Arrangement length (years) 46","Arrangement length (years) 47","Arrangement length (years) 48","Arrangement length (years) 49","Arrangement length (years) 50","Arrangement length (years) 51","Arrangement length (years) 52"]
[16,65.290000000000006,33.25,22.57,17.239999999999998,14.04,11.91,10.39,9.25,8.3699999999999992,7.67,7.09,6.61,6.21,5.86,5.57,5.31,5.08,4.88,4.7,4.53,4.3899999999999997,4.26,4.1399999999999997,4.03,3.93,3.84,3.75,3.68,3.61,3.54,3.48,3.42,3.37,3.32,3.27,3.23,3.19,3.15,3.11,3.08,3.05,3.02,2.99,2.97,2.94,2.92,2.9,2.88,2.86,2.84,2.83,2.8]
[17,66.23,33.729999999999997,22.9,17.48,14.24,12.08,10.54,9.39,8.49,7.78,7.19,6.71,6.3,5.95,5.65,5.38,5.15,4.95,4.76,4.5999999999999996,4.45,4.32,4.2,4.09,3.99,3.89,3.81,3.73,3.66,3.59,3.53,3.47,3.42,3.37,3.32,3.28,3.24,3.2,3.16,3.13,3.1,3.07,3.04,3.01,2.99,2.97,2.95,2.93,2.91,2.89,2.89]
[18,67.180000000000007,34.21,23.23,17.739999999999998,14.45,12.26,10.69,9.52,8.61,7.89,7.3,6.8,6.39,6.03,5.73,5.46,5.23,5.0199999999999996,4.83,4.67,4.5199999999999996,4.38,4.26,4.1500000000000004,4.05,3.95,3.87,3.79,3.71,3.65,3.58,3.52,3.47,3.42,3.37,3.33,3.29,3.25,3.21,3.18,3.14,3.11,3.09,3.06,3.04,3.01,2.99,2.97,2.96,2.95]
[19,68.150000000000006,34.700000000000003,23.56,17.989999999999998,14.65,12.43,10.85,9.66,8.74,8,7.4,6.9,6.48,6.12,5.81,5.54,5.3,5.09,4.9000000000000004,4.7300000000000004,4.58,4.45,4.32,4.21,4.1100000000000003,4.01,3.92,3.84,3.77,3.7,3.64,3.58,3.52,3.47,3.42,3.38,3.33,3.3,3.26,3.23,3.19,3.16,3.14,3.11,3.09,3.06,3.04,3.02,3.02]
[20,69.13,35.200000000000003,23.9,18.25,14.87,12.61,11,9.8000000000000007,8.86,8.1199999999999992,7.51,7,6.58,6.21,5.9,5.62,5.38,5.17,4.97,4.8,4.6500000000000004,4.51,4.3899999999999997,4.2699999999999996,4.17,4.07,3.98,3.9,3.82,3.75,3.69,3.63,3.57,3.52,3.47,3.43,3.39,3.35,3.31,3.28,3.24,3.21,3.19,3.16,3.14,3.11,3.09,3.09]
[21,70.13,35.71,24.24,18.510000000000002,15.08,12.79,11.16,9.94,8.99,8.24,7.62,7.1,6.67,6.3,5.98,5.7,5.46,5.24,5.05,4.87,4.72,4.58,4.45,4.33,4.2300000000000004,4.13,4.04,3.96,3.88,3.81,3.74,3.68,3.63,3.58,3.53,3.48,3.44,3.4,3.36,3.33,3.29,3.26,3.24,3.21,3.19,3.16,3.16]
[22,71.13,36.22,24.59,18.78,15.3,12.98,11.32,10.08,9.1199999999999992,8.35,7.73,7.21,6.77,6.39,6.07,5.79,5.54,5.32,5.12,4.95,4.79,4.6500000000000004,4.5199999999999996,4.4000000000000004,4.29,4.1900000000000004,4.0999999999999996,4.0199999999999996,3.94,3.87,3.8,3.74,3.68,3.63,3.58,3.53,3.49,3.45,3.41,3.38,3.35,3.32,3.29,3.26,3.24,3.23]
[23,72.150000000000006,36.74,24.95,19.05,15.52,13.16,11.49,10.23,9.25,8.48,7.84,7.31,6.87,6.48,6.16,5.87,5.62,5.39,5.2,5.0199999999999996,4.8600000000000003,4.71,4.58,4.46,4.3499999999999996,4.25,4.16,4.08,4,3.93,3.86,3.8,3.74,3.69,3.64,3.59,3.55,3.51,3.47,3.43,3.4,3.37,3.34,3.32,3.31]
[24,73.19,37.270000000000003,25.3,19.32,15.74,13.35,11.65,10.38,9.39,8.6,7.95,7.42,6.97,6.58,6.25,5.95,5.7,5.47,5.27,5.09,4.93,4.78,4.6500000000000004,4.53,4.42,4.32,4.22,4.1399999999999997,4.0599999999999996,3.99,3.92,3.85,3.8,3.74,3.69,3.65,3.6,3.56,3.52,3.49,3.46,3.43,3.4,3.39]
[25,74.239999999999995,37.799999999999997,25.67,19.600000000000001,15.97,13.55,11.82,10.53,9.52,8.7200000000000006,8.07,7.52,7.07,6.67,6.34,6.04,5.78,5.55,5.35,5.17,5,4.8499999999999996,4.72,4.5999999999999996,4.4800000000000004,4.38,4.29,4.2,4.12,4.05,3.98,3.91,3.86,3.8,3.75,3.7,3.66,3.62,3.58,3.55,3.51,3.48,3.47]
[26,75.3,38.35,26.03,19.88,16.2,13.74,11.99,10.68,9.66,8.85,8.18,7.63,7.17,6.77,6.43,6.13,5.87,5.63,5.43,5.24,5.08,4.93,4.79,4.66,4.55,4.45,4.3499999999999996,4.26,4.18,4.1100000000000003,4.04,3.98,3.92,3.86,3.81,3.76,3.72,3.68,3.64,3.61,3.57,3.56]
[27,76.38,38.89,26.41,20.170000000000002,16.43,13.94,12.16,10.83,9.8000000000000007,8.98,8.3000000000000007,7.74,7.27,6.87,6.52,6.22,5.95,5.72,5.51,5.32,5.15,5,4.8600000000000003,4.7300000000000004,4.62,4.51,4.42,4.33,4.25,4.17,4.0999999999999996,4.04,3.98,3.92,3.87,3.82,3.78,3.74,3.7,3.67,3.65]
[28,77.47,39.450000000000003,26.79,20.46,16.66,14.14,12.34,10.99,9.94,9.11,8.42,7.86,7.38,6.97,6.62,6.31,6.04,5.8,5.59,5.4,5.23,5.07,4.93,4.8099999999999996,4.6900000000000004,4.58,4.49,4.4000000000000004,4.3099999999999996,4.24,4.17,4.0999999999999996,4.04,3.99,3.93,3.89,3.84,3.8,3.77,3.75]
[29,78.569999999999993,40.01,27.17,20.75,16.899999999999999,14.34,12.51,11.15,10.08,9.24,8.5500000000000007,7.97,7.49,7.07,6.71,6.4,6.13,5.89,5.67,5.48,5.31,5.15,5.01,4.88,4.76,4.6500000000000004,4.55,4.46,4.38,4.3,4.2300000000000004,4.17,4.1100000000000003,4.05,4,3.95,3.91,3.87,3.85]
[30,79.69,40.590000000000003,27.56,21.05,17.149999999999999,14.55,12.69,11.31,10.23,9.3699999999999992,8.67,8.09,7.6,7.18,6.81,6.5,6.22,5.97,5.76,5.56,5.39,5.23,5.08,4.95,4.83,4.7300000000000004,4.63,4.53,4.45,4.37,4.3,4.24,4.17,4.12,4.07,4.0199999999999996,3.98,3.95]
[31,80.83,41.17,27.95,21.35,17.39,14.76,12.88,11.47,10.38,9.51,8.8000000000000007,8.1999999999999993,7.71,7.28,6.91,6.59,6.31,6.06,5.84,5.64,5.47,5.31,5.16,5.03,4.91,4.8,4.7,4.6100000000000003,4.5199999999999996,4.4400000000000004,4.37,4.3099999999999996,4.24,4.1900000000000004,4.1399999999999997,4.09,4.0599999999999996]
[32,81.98,41.75,28.35,21.65,17.64,14.97,13.06,11.64,10.53,9.64,8.92,8.32,7.82,7.39,7.02,6.69,6.41,6.15,5.93,5.73,5.55,5.39,5.24,5.1100000000000003,4.99,4.87,4.7699999999999996,4.68,4.59,4.5199999999999996,4.4400000000000004,4.38,4.32,4.26,4.21,4.18]
[33,83.14,42.35,28.76,21.96,17.89,15.18,13.25,11.8,10.68,9.7799999999999994,9.0500000000000007,8.4499999999999993,7.93,7.5,7.12,6.79,6.5,6.25,6.02,5.82,5.63,5.47,5.32,5.19,5.0599999999999996,4.95,4.8499999999999996,4.76,4.67,4.59,4.5199999999999996,4.45,4.3899999999999997,4.34,4.3]
[34,84.33,42.95,29.17,22.28,18.149999999999999,15.4,13.44,11.97,10.84,9.93,9.19,8.57,8.0500000000000007,7.61,7.22,6.89,6.6,6.34,6.11,5.91,5.72,5.56,5.41,5.27,5.15,5.03,4.93,4.83,4.75,4.67,4.5999999999999996,4.53,4.47,4.43]
[35,85.52,43.56,29.58,22.6,18.41,15.62,13.64,12.15,10.99,10.07,9.32,8.6999999999999993,8.17,7.72,7.33,7,6.7,6.44,6.2,6,5.81,5.64,5.49,5.35,5.23,5.1100000000000003,5.01,4.92,4.83,4.75,4.68,4.6100000000000003,4.57]
[36,86.74,44.18,30,22.92,18.670000000000002,15.85,13.83,12.32,11.15,10.220000000000001,9.4600000000000009,8.82,8.2899999999999991,7.84,7.44,7.1,6.8,6.54,6.3,6.09,5.9,5.73,5.58,5.44,5.31,5.2,5.0999999999999996,5,4.91,4.83,4.76,4.71]
[37,87.97,44.81,30.43,23.25,18.940000000000001,16.079999999999998,14.03,12.5,11.32,10.37,9.6,8.9499999999999993,8.41,7.95,7.55,7.21,6.91,6.64,6.4,6.19,6,5.83,5.67,5.53,5.4,5.29,5.18,5.09,5,4.92,4.87]
[38,89.21,45.44,30.86,23.58,19.21,16.309999999999999,14.24,12.68,11.48,10.52,9.74,9.09,8.5399999999999991,8.07,7.67,7.32,7.01,6.74,6.5,6.29,6.09,5.92,5.76,5.62,5.5,5.38,5.28,5.18,5.09,5.03]
[39,90.47,46.09,31.3,23.92,19.489999999999998,16.54,14.44,12.87,11.65,10.68,9.8800000000000008,9.2200000000000006,8.67,8.1999999999999993,7.79,7.43,7.12,6.85,6.6,6.39,6.19,6.02,5.86,5.72,5.59,5.48,5.37,5.28,5.2]
[40,91.75,46.74,31.75,24.26,19.77,16.78,14.65,13.06,11.82,10.83,10.029999999999999,9.36,8.8000000000000007,8.32,7.91,7.55,7.23,6.96,6.71,6.49,6.3,6.12,5.96,5.82,5.69,5.58,5.47,5.39]
[41,93.04,47.4,32.200000000000003,24.61,20.05,17.02,14.86,13.25,12,11,10.18,9.5,8.94,8.4499999999999993,8.0299999999999994,7.67,7.35,7.07,6.82,6.6,6.4,6.23,6.07,5.93,5.8,5.68,5.59]
[42,94.35,48.07,32.659999999999997,24.96,20.34,17.27,15.08,13.44,12.17,11.16,10.33,9.65,9.07,8.58,8.16,7.79,7.47,7.19,6.94,6.71,6.52,6.34,6.18,6.03,5.91,5.8]
[43,95.67,48.75,33.119999999999997,25.32,20.64,17.52,15.3,13.64,12.35,11.33,10.49,9.8000000000000007,9.2100000000000009,8.7200000000000006,8.2899999999999991,7.92,7.59,7.31,7.06,6.83,6.63,6.45,6.29,6.15,6.03]
[44,97.02,49.44,33.590000000000003,25.68,20.93,17.78,15.53,13.85,12.54,11.5,10.65,9.9499999999999993,9.36,8.86,8.43,8.0500000000000007,7.72,7.43,7.18,6.95,6.75,6.57,6.41,6.28]
[45,98.38,50.14,34.07,26.05,21.24,18.04,15.76,14.05,12.73,11.68,10.82,10.11,9.51,9,8.57,8.19,7.86,7.56,7.31,7.08,6.88,6.7,6.55]
[46,99.75,50.85,34.56,26.42,21.55,18.3,15.99,14.26,12.93,11.86,10.99,10.27,9.67,9.15,8.7100000000000009,8.33,7.99,7.7,7.44,7.22,7.01,6.85]
[47,101.15,51.57,35.049999999999997,26.8,21.86,18.57,16.23,14.48,13.13,12.05,11.17,10.44,9.83,9.31,8.86,8.48,8.14,7.85,7.59,7.36,7.17]
[48,102.56,52.29,35.549999999999997,27.19,22.18,18.850000000000001,16.48,14.7,13.33,12.24,11.35,10.61,9.99,9.4700000000000006,9.02,8.6300000000000008,8.2899999999999991,8,7.74,7.52]
[49,103.99,53.03,36.06,27.59,22.51,19.14,16.73,14.93,13.54,12.44,11.54,10.79,10.17,9.64,9.18,8.7899999999999991,8.4499999999999993,8.16,7.91]
[50,105.45,53.79,36.58,27.99,22.85,19.43,16.989999999999998,15.17,13.76,12.64,11.73,10.98,10.35,9.82,9.36,8.9600000000000009,8.6199999999999992,8.33]
[51,106.93,54.56,37.11,28.41,23.19,19.73,17.260000000000002,15.42,13.99,12.86,11.94,11.18,10.54,10,9.5399999999999991,9.15,8.81]
[52,108.44,55.34,37.659999999999997,28.83,23.55,20.04,17.54,15.67,14.23,13.08,12.15,11.38,10.74,10.199999999999999,9.74,9.35]
[53,109.97,56.14,38.22,29.27,23.91,20.36,17.82,15.93,14.47,13.32,12.38,11.6,10.95,10.41,9.9499999999999993]
[54,111.54,56.96,38.79,29.72,24.29,20.69,18.12,16.21,14.73,13.56,12.61,11.83,11.18,10.64]
[55,113.15,57.8,39.380000000000003,30.19,24.69,21.03,18.440000000000001,16.5,15.01,13.82,12.87,12.08,11.43]
[56,114.8,58.67,39.99,30.67,25.09,21.39,18.760000000000002,16.809999999999999,15.3,14.1,13.14,12.34]
[57,116.49,59.57,40.619999999999997,31.17,25.52,21.77,19.11,17.13,15.6,14.4,13.42]
[58,118.24,60.5,41.28,31.7,25.97,22.17,19.48,17.48,15.93,14.71]
[59,120.06,61.47,41.97,32.25,26.45,22.6,19.87,17.850000000000001,16.28]
[60,121.95,62.48,42.7,32.840000000000003,26.96,23.06,20.3,18.239999999999998]
[61,123.93,63.55,43.47,33.47,27.5,23.55,20.74]
[62,126.03,64.69,44.3,34.15,28.09,24.06]
[63,128.27000000000001,65.92,45.19,34.880000000000003,28.7]
[64,130.69999999999999,67.25,46.17,35.64]
[65,133.33000000000001,68.709999999999994,47.18]
[66,136.19999999999999,70.209999999999994]
[67,139.16999999999999]

{"sheet":"x-720","index":70,"n_rows":77,"n_cols":53,"rows_kept":77,"cut":false,"hidden":false,"merged":[]}
["Government Actuary's Department"]
[{"$f":"IF(TITLE=\"> Enter workbook title here\",\"Enter workbook title in Cover sheet\",TITLE)","v":"Local Government Pension Scheme (LGPS) - Consolidated Factor Spreadsheet"}]
[{"$f":"TABLE_FACTOR_TYPE&\" - x-\"&TABLE_SERIES_NUMBER","v":"Added pension - x-720"}]
[]
[]
["Data Item","Factor Table Information"]
["Scheme","LGPS_EW"]
["Section","post 2014"]
["Factor Type","Added pension"]
["Description","Additional pension - Regular monthly contributions - Females with NPA 68 (purchase of additional pension after 1 April 2014)"]
["Gender","Female"]
["Factor Age/Period Definition","Age at first contribution"]
["Section Number",0]
["Series Number",720]
["Table Reference","0-720"]
["Table Reference in Guidance","Table J"]
["Related Factor Guidance Note","LGPS EW Additional Pension post-2014 1 March 2019"]
["Date Factors Issued to Client","2023-09-26"]
["Date Factors Implemented (if known)","2023-10-02"]
["Factor Status","Issued"]
[]
[null,{"$f":"HYPERLINK(\"#'Factor List'!A1\",\"Back to Factor List\")","v":"Back to Factor List"}]
[]
[]
["Age","Arrangement length (years) 1","Arrangement length (years) 2","Arrangement length (years) 3","Arrangement length (years) 4","Arrangement length (years) 5","Arrangement length (years) 6","Arrangement length (years) 7","Arrangement length (years) 8","Arrangement length (years) 9","Arrangement length (years) 10","Arrangement length (years) 11","Arrangement length (years) 12","Arrangement length (years) 13","Arrangement length (years) 14","Arrangement length (years) 15","Arrangement length (years) 16","Arrangement length (years) 17","Arrangement length (years) 18","Arrangement length (years) 19","Arrangement length (years) 20","Arrangement length (years) 21","Arrangement length (years) 22","Arrangement length (years) 23","Arrangement length (years) 24","Arrangement length (years) 25","Arrangement length (years) 26","Arrangement length (years) 27","Arrangement length (years) 28","Arrangement length (years) 29","Arrangement length (years) 30","Arrangement length (years) 31","Arrangement length (years) 32","Arrangement length (years) 33","Arrangement length (years) 34","Arrangement length (years) 35","Arrangement length (years) 36","Arrangement length (years) 37","Arrangement length (years) 38","Arrangement length (years) 39","Arrangement length (years) 40","Arrangement length (years) 41","Arrangement length (years) 42","Arrangement length (years) 43","Arrangement length (years) 44","Arrangement length (years) 45","Arrangement length (years) 46","Arrangement length (years) 47","Arrangement length (years) 48","Arrangement length (years) 49","Arrangement length (years) 50","Arrangement length (years) 51","Arrangement length (years) 52"]
[16,71.06,36.18,24.56,18.75,15.27,12.96,11.3,10.07,9.1,8.34,7.71,7.19,6.75,6.38,6.05,5.77,5.52,5.3,5.0999999999999996,4.93,4.7699999999999996,4.63,4.5,4.38,4.2699999999999996,4.17,4.08,3.99,3.92,3.84,3.78,3.71,3.65,3.6,3.55,3.5,3.46,3.42,3.38,3.34,3.31,3.27,3.24,3.21,3.19,3.16,3.14,3.12,3.1,3.08,3.06,3.03]
[17,72.099999999999994,36.71,24.92,19.03,15.5,13.15,11.47,10.210000000000001,9.24,8.4600000000000009,7.82,7.3,6.85,6.47,6.14,5.85,5.6,5.38,5.18,5,4.84,4.6900000000000004,4.5599999999999996,4.4400000000000004,4.33,4.2300000000000004,4.1399999999999997,4.05,3.97,3.9,3.83,3.77,3.71,3.65,3.6,3.56,3.51,3.47,3.43,3.39,3.36,3.32,3.29,3.26,3.24,3.21,3.19,3.17,3.15,3.13,3.12]
[18,73.17,37.26,25.29,19.309999999999999,15.73,13.34,11.64,10.36,9.3800000000000008,8.58,7.94,7.4,6.95,6.56,6.23,5.94,5.68,5.46,5.26,5.07,4.91,4.76,4.63,4.51,4.4000000000000004,4.29,4.2,4.1100000000000003,4.03,3.96,3.89,3.83,3.77,3.71,3.66,3.61,3.56,3.52,3.48,3.44,3.41,3.38,3.34,3.32,3.29,3.26,3.24,3.22,3.2,3.19]
[19,74.239999999999995,37.799999999999997,25.66,19.600000000000001,15.96,13.54,11.81,10.52,9.51,8.7100000000000009,8.06,7.51,7.05,6.66,6.32,6.03,5.77,5.54,5.33,5.15,4.9800000000000004,4.83,4.7,4.58,4.46,4.3600000000000003,4.26,4.17,4.09,4.0199999999999996,3.95,3.88,3.82,3.77,3.71,3.66,3.62,3.57,3.53,3.5,3.46,3.43,3.4,3.37,3.34,3.32,3.29,3.27,3.26]
[20,75.33,38.36,26.04,19.88,16.190000000000001,13.74,11.98,10.67,9.65,8.84,8.18,7.62,7.16,6.76,6.42,6.12,5.85,5.62,5.41,5.23,5.0599999999999996,4.91,4.7699999999999996,4.6399999999999997,4.53,4.42,4.33,4.24,4.1500000000000004,4.08,4.01,3.94,3.88,3.82,3.77,3.72,3.67,3.63,3.59,3.55,3.52,3.48,3.45,3.42,3.39,3.37,3.35,3.33]
[21,76.44,38.92,26.42,20.18,16.43,13.94,12.16,10.83,9.8000000000000007,8.9700000000000006,8.3000000000000007,7.74,7.26,6.86,6.51,6.21,5.94,5.7,5.49,5.3,5.13,4.9800000000000004,4.84,4.71,4.5999999999999996,4.49,4.3899999999999997,4.3,4.22,4.1399999999999997,4.07,4,3.94,3.88,3.83,3.78,3.73,3.69,3.64,3.61,3.57,3.54,3.51,3.48,3.45,3.42,3.41]
[22,77.56,39.49,26.81,20.47,16.670000000000002,14.14,12.34,10.99,9.94,9.1,8.42,7.85,7.37,6.96,6.61,6.3,6.03,5.79,5.57,5.38,5.21,5.05,4.91,4.78,4.66,4.5599999999999996,4.46,4.37,4.28,4.2,4.13,4.0599999999999996,4,3.94,3.89,3.84,3.79,3.74,3.7,3.66,3.63,3.59,3.56,3.53,3.51,3.49]
[23,78.7,40.07,27.2,20.77,16.920000000000002,14.35,12.52,11.15,10.09,9.24,8.5399999999999991,7.97,7.48,7.06,6.7,6.39,6.12,5.87,5.66,5.46,5.29,5.13,4.99,4.8499999999999996,4.7300000000000004,4.62,4.5199999999999996,4.43,4.3499999999999996,4.2699999999999996,4.1900000000000004,4.12,4.0599999999999996,4,3.95,3.89,3.85,3.8,3.76,3.72,3.69,3.65,3.62,3.59,3.57]
[24,79.849999999999994,40.659999999999997,27.6,21.08,17.170000000000002,14.56,12.7,11.31,10.23,9.3699999999999992,8.67,8.08,7.59,7.17,6.8,6.49,6.21,5.96,5.74,5.54,5.37,5.21,5.0599999999999996,4.93,4.8099999999999996,4.6900000000000004,4.59,4.5,4.41,4.33,4.26,4.1900000000000004,4.12,4.0599999999999996,4.01,3.96,3.91,3.86,3.82,3.78,3.75,3.71,3.68,3.66]
[25,81.02,41.25,28.01,21.39,17.420000000000002,14.78,12.89,11.48,10.38,9.51,8.8000000000000007,8.1999999999999993,7.7,7.27,6.9,6.58,6.3,6.05,5.83,5.63,5.45,5.28,5.14,5,4.88,4.7699999999999996,4.66,4.57,4.4800000000000004,4.4000000000000004,4.32,4.25,4.1900000000000004,4.13,4.07,4.0199999999999996,3.97,3.92,3.88,3.84,3.81,3.77,3.75]
[26,82.2,41.86,28.42,21.7,17.670000000000002,14.99,13.08,11.65,10.54,9.65,8.93,8.32,7.82,7.38,7.01,6.68,6.39,6.14,5.91,5.71,5.53,5.36,5.21,5.08,4.95,4.84,4.7300000000000004,4.6399999999999997,4.55,4.46,4.3899999999999997,4.32,4.25,4.1900000000000004,4.13,4.08,4.03,3.99,3.95,3.91,3.87,3.85]
[27,83.41,42.47,28.83,22.02,17.93,15.21,13.27,11.82,10.69,9.7899999999999991,9.06,8.4499999999999993,7.93,7.49,7.11,6.78,6.49,6.23,6,5.79,5.61,5.44,5.29,5.15,5.03,4.91,4.8,4.71,4.62,4.53,4.46,4.38,4.32,4.26,4.2,4.1500000000000004,4.0999999999999996,4.05,4.01,3.97,3.95]
[28,84.62,43.09,29.25,22.34,18.190000000000001,15.44,13.47,11.99,10.85,9.94,9.19,8.57,8.0500000000000007,7.6,7.22,6.88,6.58,6.32,6.09,5.88,5.69,5.52,5.37,5.23,5.0999999999999996,4.99,4.88,4.78,4.6900000000000004,4.5999999999999996,4.53,4.45,4.3899999999999997,4.33,4.2699999999999996,4.21,4.17,4.12,4.08,4.05]
[29,85.86,43.72,29.68,22.67,18.46,15.66,13.66,12.17,11.01,10.08,9.33,8.6999999999999993,8.17,7.71,7.32,6.98,6.68,6.42,6.18,5.97,5.78,5.61,5.45,5.31,5.18,5.0599999999999996,4.95,4.8499999999999996,4.76,4.68,4.5999999999999996,4.5199999999999996,4.46,4.4000000000000004,4.34,4.28,4.24,4.1900000000000004,4.16]
[30,87.11,44.36,30.11,23,18.73,15.89,13.86,12.35,11.17,10.23,9.4600000000000009,8.83,8.2899999999999991,7.83,7.43,7.09,6.78,6.51,6.27,6.06,5.87,5.69,5.53,5.39,5.26,5.14,5.03,4.93,4.84,4.75,4.67,4.5999999999999996,4.53,4.47,4.41,4.3600000000000003,4.3099999999999996,4.2699999999999996]
[31,88.38,45,30.55,23.33,19.010000000000002,16.12,14.07,12.53,11.33,10.38,9.6,8.9600000000000009,8.41,7.94,7.54,7.19,6.88,6.61,6.37,6.15,5.96,5.78,5.62,5.47,5.34,5.22,5.1100000000000003,5.01,4.91,4.83,4.75,4.67,4.5999999999999996,4.54,4.4800000000000004,4.43,4.3899999999999997]
[32,89.66,45.66,31,23.67,19.28,16.36,14.27,12.71,11.5,10.53,9.74,9.09,8.5299999999999994,8.06,7.65,7.3,6.99,6.71,6.46,6.24,6.05,5.87,5.71,5.56,5.42,5.3,5.19,5.09,4.99,4.9000000000000004,4.82,4.75,4.68,4.62,4.5599999999999996,4.5199999999999996]
[33,90.97,46.32,31.45,24.02,19.559999999999999,16.600000000000001,14.48,12.9,11.67,10.69,9.89,9.2200000000000006,8.66,8.18,7.77,7.41,7.09,6.81,6.56,6.34,6.14,5.96,5.79,5.65,5.51,5.39,5.27,5.17,5.07,4.9800000000000004,4.9000000000000004,4.83,4.76,4.7,4.6500000000000004]
[34,92.29,47,31.91,24.37,19.850000000000001,16.84,14.7,13.09,11.84,10.85,10.029999999999999,9.36,8.7899999999999991,8.3000000000000007,7.88,7.52,7.2,6.91,6.66,6.44,6.23,6.05,5.88,5.73,5.6,5.47,5.36,5.25,5.16,5.07,4.99,4.91,4.84,4.79]
[35,93.63,47.68,32.369999999999997,24.72,20.14,17.09,14.91,13.28,12.02,11.01,10.18,9.5,8.92,8.43,8,7.63,7.31,7.02,6.76,6.54,6.33,6.14,5.98,5.82,5.69,5.56,5.44,5.34,5.24,5.15,5.07,5,4.9400000000000004]
[36,94.98,48.37,32.840000000000003,25.08,20.43,17.34,15.13,13.48,12.19,11.17,10.33,9.64,9.0500000000000007,8.5500000000000007,8.1199999999999992,7.75,7.42,7.13,6.87,6.64,6.43,6.24,6.07,5.92,5.78,5.65,5.53,5.43,5.33,5.24,5.16,5.09]
[37,96.36,49.07,33.32,25.45,20.73,17.59,15.35,13.67,12.37,11.33,10.49,9.7799999999999994,9.19,8.68,8.25,7.87,7.53,7.24,6.97,6.74,6.53,6.34,6.17,6.01,5.87,5.74,5.63,5.52,5.42,5.33,5.26]
[38,97.75,49.78,33.799999999999997,25.82,21.03,17.850000000000001,15.58,13.88,12.56,11.5,10.64,9.93,9.33,8.81,8.3699999999999992,7.99,7.65,7.35,7.08,6.85,6.63,6.44,6.27,6.11,5.97,5.84,5.72,5.62,5.52,5.44]
[39,99.16,50.51,34.29,26.2,21.34,18.11,15.81,14.08,12.74,11.67,10.8,10.08,9.4700000000000006,8.9499999999999993,8.5,8.11,7.77,7.46,7.2,6.96,6.74,6.55,6.37,6.22,6.07,5.94,5.82,5.72,5.63]
[40,100.59,51.24,34.79,26.58,21.65,18.38,16.04,14.29,12.93,11.85,10.96,10.23,9.61,9.09,8.6300000000000008,8.24,7.89,7.58,7.31,7.07,6.85,6.66,6.48,6.32,6.18,6.05,5.93,5.83]
[41,102.04,51.98,35.299999999999997,26.96,21.97,18.64,16.27,14.5,13.12,12.03,11.13,10.39,9.76,9.23,8.77,8.36,8.01,7.7,7.43,7.18,6.97,6.77,6.59,6.43,6.29,6.16,6.05]
[42,103.51,52.73,35.81,27.36,22.29,18.920000000000002,16.510000000000002,14.72,13.32,12.21,11.3,10.55,9.91,9.3699999999999992,8.9,8.5,8.14,7.83,7.55,7.3,7.08,6.89,6.71,6.55,6.4,6.28]
[43,104.99,53.49,36.33,27.75,22.62,19.2,16.760000000000002,14.93,13.52,12.39,11.47,10.71,10.06,9.52,9.0399999999999991,8.6300000000000008,8.27,7.96,7.68,7.43,7.21,7.01,6.83,6.67,6.53]
[44,106.5,54.26,36.85,28.16,22.95,19.48,17.010000000000002,15.16,13.72,12.58,11.65,10.87,10.220000000000001,9.67,9.19,8.77,8.41,8.09,7.81,7.56,7.33,7.13,6.95,6.8]
[45,108.02,55.04,37.39,28.57,23.28,19.77,17.260000000000002,15.39,13.93,12.77,11.83,11.04,10.38,9.82,9.34,8.92,8.5500000000000007,8.23,7.95,7.69,7.47,7.27,7.09]
[46,109.57,55.83,37.93,28.99,23.63,20.059999999999999,17.52,15.62,14.14,12.97,12.01,11.22,10.55,9.98,9.49,9.07,8.6999999999999993,8.3800000000000008,8.09,7.83,7.61,7.41]
[47,111.13,56.63,38.479999999999997,29.41,23.98,20.36,17.78,15.86,14.36,13.17,12.2,11.4,10.72,10.15,9.66,9.23,8.85,8.5299999999999994,8.24,7.98,7.76]
[48,112.72,57.45,39.04,29.84,24.33,20.67,18.05,16.100000000000001,14.59,13.38,12.4,11.59,10.9,10.32,9.82,9.39,9.01,8.68,8.39,8.14]
[49,114.33,58.27,39.6,30.28,24.69,20.98,18.329999999999998,16.350000000000001,14.82,13.59,12.6,11.78,11.09,10.5,10,9.56,9.18,8.85,8.56]
[50,115.96,59.12,40.18,30.73,25.06,21.3,18.61,16.61,15.05,13.82,12.81,11.98,11.28,10.69,10.18,9.74,9.36,9.02]
[51,117.61,59.97,40.770000000000003,31.18,25.44,21.62,18.899999999999999,16.87,15.3,14.04,13.03,12.19,11.48,10.88,10.37,9.93,9.5399999999999991]
[52,119.29,60.84,41.37,31.65,25.83,21.96,19.2,17.14,15.55,14.28,13.25,12.4,11.69,11.09,10.57,10.119999999999999]
[53,121,61.72,41.98,32.130000000000003,26.23,22.3,19.510000000000002,17.420000000000002,15.81,14.53,13.49,12.63,11.91,11.31,10.78]
[54,122.74,62.63,42.61,32.619999999999997,26.63,22.66,19.829999999999998,17.72,16.09,14.79,13.74,12.87,12.15,11.53]
[55,124.5,63.55,43.25,33.119999999999997,27.06,23.03,20.16,18.02,16.37,15.06,14,13.13,12.38]
[56,126.31,64.489999999999995,43.91,33.64,27.49,23.41,20.51,18.34,16.670000000000002,15.35,14.28,13.38]
[57,128.15,65.459999999999994,44.59,34.18,27.95,23.81,20.87,18.68,16.989999999999998,15.66,14.56]
[58,130.03,66.45,45.29,34.729999999999997,28.42,24.23,21.25,19.04,17.329999999999998,15.96]
[59,131.97999999999999,67.48,46.02,35.31,28.92,24.67,21.66,19.420000000000002,17.670000000000002]
[60,133.99,68.55,46.78,35.93,29.44,25.14,22.09,19.8]
[61,136.07,69.67,47.58,36.57,30,25.64,22.52]
[62,138.25,70.849999999999994,48.43,37.26,30.6,26.14]
[63,140.55000000000001,72.099999999999994,49.34,38.01,31.19]
[64,143,73.44,50.32,38.75]
[65,145.63,74.89,51.3]
[66,148.47,76.349999999999994]
[67,151.36000000000001]

{"sheet":"x-801","index":71,"n_rows":51,"n_cols":5,"rows_kept":51,"cut":false,"hidden":false,"merged":[]}
["Government Actuary's Department"]
[{"$f":"IF(TITLE=\"> Enter workbook title here\",\"Enter workbook title in Cover sheet\",TITLE)","v":"Local Government Pension Scheme (LGPS) - Consolidated Factor Spreadsheet"}]
[{"$f":"TABLE_FACTOR_TYPE&\" - x-\"&TABLE_SERIES_NUMBER","v":"AVC to transfer credits - x-801"}]
[]
[]
["Data Item","Factor Table Information"]
["Scheme","LGPS_EW"]
["Section","All"]
["Factor Type","AVC to transfer credits"]
["Description","Factors for the conversion of accumulated AVCs to transfer credits"]
["Gender","Male & Female"]
["Factor Age/Period Definition","Age last birthday at relevant date"]
["Section Number",0]
["Series Number",801]
["Table Reference","0-801"]
["Table Reference in Guidance","Table 4.1"]
["Related Factor Guidance Note","LGPS EW Reg 66(8) conversion of accumulated AVC to transfer credits 5 May 2021"]
["Date Factors Issued to Client","2023-09-26"]
["Date Factors Implemented (if known)","2023-10-02"]
["Factor Status","Issued"]
[]
[null,{"$f":"HYPERLINK(\"#'Factor List'!A1\",\"Back to Factor List\")","v":"Back to Factor List"}]
[]
[]
["Age","Gross Pension Factor - Male members","Surviving Partner's Pension Factor - Male members","Gross Pension Factor - Female members","Surviving Partner's Pension Factor - Female members"]
[50,19.68,2.8,19.68,2.8]
[51,19.63,2.78,19.63,2.78]
[52,19.579999999999998,2.75,19.579999999999998,2.75]
[53,19.54,2.72,19.54,2.72]
[54,19.489999999999998,2.7,19.489999999999998,2.7]
[55,19.45,2.67,19.45,2.67]
[56,19.41,2.64,19.41,2.64]
[57,19.38,2.6,19.38,2.6]
[58,19.34,2.58,19.34,2.58]
[59,19.32,2.5299999999999998,19.32,2.5299999999999998]
[60,19.3,2.4900000000000002,19.3,2.4900000000000002]
[61,19.29,2.4500000000000002,19.29,2.4500000000000002]
[62,19.28,2.41,19.28,2.41]
[63,19.29,2.35,19.29,2.35]
[64,19.309999999999999,2.2999999999999998,19.309999999999999,2.2999999999999998]
[65,19.02,2.2799999999999998,19.02,2.2799999999999998]
[66,18.43,2.2599999999999998,18.43,2.2599999999999998]
[67,17.829999999999998,2.2599999999999998,17.829999999999998,2.2599999999999998]
[68,17.239999999999998,2.25,17.239999999999998,2.25]
[69,16.66,2.11,16.66,2.11]
[70,16.079999999999998,1.97,16.079999999999998,1.97]
[71,15.51,1.96,15.51,1.96]
[72,14.95,1.94,14.95,1.94]
[73,14.4,1.92,14.4,1.92]
[74,13.87,1.78,13.87,1.78]
[75,13.36,1.63,13.36,1.63]

{"sheet":"x-802","index":72,"n_rows":85,"n_cols":4,"rows_kept":85,"cut":false,"hidden":false,"merged":[[24,0,24,1]]}
["Government Actuary's Department"]
[{"$f":"IF(TITLE=\"> Enter workbook title here\",\"Enter workbook title in Cover sheet\",TITLE)","v":"Local Government Pension Scheme (LGPS) - Consolidated Factor Spreadsheet"}]
[{"$f":"TABLE_FACTOR_TYPE&\" - x-\"&TABLE_SERIES_NUMBER","v":"AVC to AP - x-802"}]
[]
[]
["Data Item","Factor Table Information"]
["Scheme","LGPS_EW"]
["Section","All"]
["Factor Type","AVC to AP"]
["Description","Use of accumulated AVCs for additional pension (pre-14) - Amount of additional annual pension for every £100 of accumulated AVCs - Retirements in normal health"]
["Gender","Male & Female"]
["Factor Age/Period Definition","Age at date member becomes entitled to an immediate pension or, if later, the date of election under Regulation 26(4) in years and complete months"]
["Section Number",0]
["Series Number",802]
["Table Reference","0-802"]
["Table Reference in Guidance","Table 1"]
["Related Factor Guidance Note","LGPS EW Use of accumulated AVCs to provide additional pension pre-14 14 April 2016"]
["Date Factors Issued to Client","2023-09-26"]
["Date Factors Implemented (if known)","2023-10-02"]
["Factor Status","Issued"]
[]
[null,{"$f":"HYPERLINK(\"#'Factor List'!A1\",\"Back to Factor List\")","v":"Back to Factor List"}]
[]
[]
["Age",null,"Pension (£) for member if bought with dependants' benefits","Pension (£) for member only"]
["from","to"]
["55 years and 0 months","55 years and 5 months",3.83,3.99]
["55 years and 6 months","55 years and 11 months",3.87,4.04]
[null,null,"",""]
["56 years and 0 months","56 years and 5 months",3.91,4.08]
["56 years and 6 months","56 years and 11 months",3.96,4.13]
[null,null,"",""]
["57 years and 0 months","57 years and 5 months",4,4.18]
["57 years and 6 months","57 years and 11 months",4.05,4.2300000000000004]
[null,null,"",""]
["58 years and 0 months","58 years and 5 months",4.0999999999999996,4.29]
["58 years and 6 months","58 years and 11 months",4.1500000000000004,4.34]
[null,null,"",""]
["59 years and 0 months","59 years and 5 months",4.2,4.4000000000000004]
["59 years and 6 months","59 years and 11 months",4.25,4.46]
[null,null,"",""]
["60 years and 0 months","60 years and 5 months",4.3,4.51]
["60 years and 6 months","60 years and 11 months",4.3600000000000003,4.58]
[null,null,"",""]
["61 years and 0 months","61 years and 5 months",4.41,4.6399999999999997]
["61 years and 6 months","61 years and 11 months",4.47,4.7]
[null,null,"",""]
["62 years and 0 months","62 years and 5 months",4.53,4.7699999999999996]
["62 years and 6 months","62 years and 11 months",4.5999999999999996,4.84]
[null,null,"",""]
["63 years and 0 months","63 years and 5 months",4.66,4.91]
["63 years and 6 months","63 years and 11 months",4.7300000000000004,4.9800000000000004]
[null,null,"",""]
["64 years and 0 months","64 years and 5 months",4.79,5.0599999999999996]
["64 years and 6 months","64 years and 11 months",4.8600000000000003,5.14]
[null,null,"",""]
["65 years and 0 months","65 years and 5 months",4.9400000000000004,5.22]
["65 years and 6 months","65 years and 11 months",5.0199999999999996,5.32]
[null,null,"",""]
["66 years and 0 months","66 years and 5 months",5.1100000000000003,5.41]
["66 years and 6 months","66 years and 11 months",5.2,5.51]
[null,null,"",""]
["67 years and 0 months","67 years and 5 months",5.29,5.62]
["67 years and 6 months","67 years and 11 months",5.39,5.73]
[null,null,"",""]
["68 years and 0 months","68 years and 5 months",5.49,5.84]
["68 years and 6 months","68 years and 11 months",5.6,5.96]
[null,null,"",""]
["69 years and 0 months","69 years and 5 months",5.71,6.08]
["69 years and 6 months","69 years and 11 months",5.82,6.21]
[null,null,"",""]
["70 years and 0 months","70 years and 5 months",5.94,6.34]
["70 years and 6 months","70 years and 11 months",6.07,6.48]
[null,null,"",""]
["71 years and 0 months","71 years and 5 months",6.2,6.63]
["71 years and 6 months","71 years and 11 months",6.33,6.78]
[null,null,"",""]
["72 years and 0 months","72 years and 5 months",6.47,6.94]
["72 years and 6 months","72 years and 11 months",6.61,7.1]
[null,null,"",""]
["73 years and 0 months","73 years and 5 months",6.77,7.27]
["73 years and 6 months","73 years and 11 months",6.92,7.45]
[null,null,"",""]
["74 years and 0 months","74 years and 5 months",7.08,7.64]
["74 years and 6 months","74 years and 11 months",7.25,7.83]

{"sheet":"x-803","index":73,"n_rows":160,"n_cols":4,"rows_kept":160,"cut":false,"hidden":false,"merged":[[24,0,24,1]]}
["Government Actuary's Department"]
[{"$f":"IF(TITLE=\"> Enter workbook title here\",\"Enter workbook title in Cover sheet\",TITLE)","v":"Local Government Pension Scheme (LGPS) - Consolidated Factor Spreadsheet"}]
[{"$f":"TABLE_FACTOR_TYPE&\" - x-\"&TABLE_SERIES_NUMBER","v":"AVC to AP - x-803"}]
[]
[]
["Data Item","Factor Table Information"]
["Scheme","LGPS_EW"]
["Section","All"]
["Factor Type","AVC to AP"]
["Description","Use of accumulated AVCs for additional pension (pre-14) - Amount of additional annual pension for every £100 of accumulated AVCs - Retirements in ill health"]
["Gender","Male & Female"]
["Factor Age/Period Definition","Age at date member becomes entitled to an immediate pension or, if later, the date of election under Regulation 26(4) in years and complete months"]
["Section Number",0]
["Series Number",803]
["Table Reference","0-803"]
["Table Reference in Guidance","Table 2"]
["Related Factor Guidance Note","LGPS EW Use of accumulated AVCs to provide additional pension pre-14 14 April 2016"]
["Date Factors Issued to Client","2023-09-26"]
["Date Factors Implemented (if known)","2023-10-02"]
["Factor Status","Issued"]
[]
[null,{"$f":"HYPERLINK(\"#'Factor List'!A1\",\"Back to Factor List\")","v":"Back to Factor List"}]
[]
[]
["Age",null,"Pension (£) for member if bought with dependants' benefits","Pension (£) for member only"]
["from","to"]
["30 years and 0 months","30 years and 5 months",3.07,3.42]
["30 years and 6 months","30 years and 11 months",3.08,3.44]
[null,null,"",""]
["31 years and 0 months","31 years and 5 months",3.09,3.45]
["31 years and 6 months","31 years and 11 months",3.11,3.46]
[null,null,"",""]
["32 years and 0 months","32 years and 5 months",3.12,3.48]
["32 years and 6 months","32 years and 11 months",3.13,3.49]
[null,null,"",""]
["33 years and 0 months","33 years and 5 months",3.15,3.51]
["33 years and 6 months","33 years and 11 months",3.16,3.52]
[null,null,"",""]
["34 years and 0 months","34 years and 5 months",3.18,3.53]
["34 years and 6 months","34 years and 11 months",3.19,3.55]
[null,null,"",""]
["35 years and 0 months","35 years and 5 months",3.21,3.56]
["35 years and 6 months","35 years and 11 months",3.22,3.58]
[null,null,"",""]
["36 years and 0 months","36 years and 5 months",3.24,3.59]
["36 years and 6 months","36 years and 11 months",3.25,3.61]
[null,null,"",""]
["37 years and 0 months","37 years and 5 months",3.27,3.62]
["37 years and 6 months","37 years and 11 months",3.29,3.64]
[null,null,"",""]
["38 years and 0 months","38 years and 5 months",3.3,3.66]
["38 years and 6 months","38 years and 11 months",3.32,3.67]
[null,null,"",""]
["39 years and 0 months","39 years and 5 months",3.34,3.69]
["39 years and 6 months","39 years and 11 months",3.36,3.71]
[null,null,"",""]
["40 years and 0 months","40 years and 5 months",3.37,3.73]
["40 years and 6 months","40 years and 11 months",3.39,3.75]
[null,null,"",""]
["41 years and 0 months","41 years and 5 months",3.41,3.76]
["41 years and 6 months","41 years and 11 months",3.43,3.78]
[null,null,"",""]
["42 years and 0 months","42 years and 5 months",3.45,3.8]
["42 years and 6 months","42 years and 11 months",3.47,3.82]
[null,null,"",""]
["43 years and 0 months","43 years and 5 months",3.49,3.85]
["43 years and 6 months","43 years and 11 months",3.52,3.87]
[null,null,"",""]
["44 years and 0 months","44 years and 5 months",3.54,3.89]
["44 years and 6 months","44 years and 11 months",3.56,3.91]
[null,null,"",""]
["45 years and 0 months","45 years and 5 months",3.59,3.94]
["45 years and 6 months","45 years and 11 months",3.61,3.96]
[null,null,"",""]
["46 years and 0 months","46 years and 5 months",3.63,3.99]
["46 years and 6 months","46 years and 11 months",3.66,4.01]
[null,null,"",""]
["47 years and 0 months","47 years and 5 months",3.69,4.04]
["47 years and 6 months","47 years and 11 months",3.71,4.07]
[null,null,"",""]
["48 years and 0 months","48 years and 5 months",3.74,4.09]
["48 years and 6 months","48 years and 11 months",3.77,4.12]
[null,null,"",""]
["49 years and 0 months","49 years and 5 months",3.8,4.1500000000000004]
["49 years and 6 months","49 years and 11 months",3.83,4.18]
[null,null,"",""]
["50 years and 0 months","50 years and 5 months",3.86,4.22]
["50 years and 6 months","50 years and 11 months",3.89,4.25]
[null,null,"",""]
["51 years and 0 months","51 years and 5 months",3.92,4.28]
["51 years and 6 months","51 years and 11 months",3.96,4.32]
[null,null,"",""]
["52 years and 0 months","52 years and 5 months",3.99,4.3499999999999996]
["52 years and 6 months","52 years and 11 months",4.03,4.3899999999999997]
[null,null,"",""]
["53 years and 0 months","53 years and 5 months",4.0599999999999996,4.43]
["53 years and 6 months","53 years and 11 months",4.0999999999999996,4.47]
[null,null,"",""]
["54 years and 0 months","54 years and 5 months",4.1399999999999997,4.51]
["54 years and 6 months","54 years and 11 months",4.18,4.5599999999999996]
[null,null,"",""]
["55 years and 0 months","55 years and 5 months",4.22,4.5999999999999996]
["55 years and 6 months","55 years and 11 months",4.2699999999999996,4.6500000000000004]
[null,null,"",""]
["56 years and 0 months","56 years and 5 months",4.3099999999999996,4.7]
["56 years and 6 months","56 years and 11 months",4.3600000000000003,4.75]
[null,null,"",""]
["57 years and 0 months","57 years and 5 months",4.41,4.8]
["57 years and 6 months","57 years and 11 months",4.45,4.8499999999999996]
[null,null,"",""]
["58 years and 0 months","58 years and 5 months",4.5,4.91]
["58 years and 6 months","58 years and 11 months",4.5599999999999996,4.97]
[null,null,"",""]
["59 years and 0 months","59 years and 5 months",4.6100000000000003,5.03]
["59 years and 6 months","59 years and 11 months",4.67,5.09]
[null,null,"",""]
["60 years and 0 months","60 years and 5 months",4.72,5.15]
["60 years and 6 months","60 years and 11 months",4.78,5.22]
[null,null,"",""]
["61 years and 0 months","61 years and 5 months",4.8499999999999996,5.29]
["61 years and 6 months","61 years and 11 months",4.91,5.36]
[null,null,"",""]
["62 years and 0 months","62 years and 5 months",4.9800000000000004,5.43]
["62 years and 6 months","62 years and 11 months",5.04,5.51]
[null,null,"",""]
["63 years and 0 months","63 years and 5 months",5.1100000000000003,5.59]
["63 years and 6 months","63 years and 11 months",5.19,5.67]
[null,null,"",""]
["64 years and 0 months","64 years and 5 months",5.26,5.76]
["64 years and 6 months","64 years and 11 months",5.34,5.85]
[null,null,"",""]
["65 years and 0 months","65 years and 5 months",5.43,5.95]
["65 years and 6 months","65 years and 11 months",5.53,6.07]
[null,null,"",""]
["66 years and 0 months","66 years and 5 months",5.64,6.2]
["66 years and 6 months","66 years and 11 months",5.75,6.33]
[null,null,"",""]
["67 years and 0 months","67 years and 5 months",5.87,6.46]
["67 years and 6 months","67 years and 11 months",5.99,6.61]
[null,null,"",""]
["68 years and 0 months","68 years and 5 months",6.12,6.76]
["68 years and 6 months","68 years and 11 months",6.25,6.91]
[null,null,"",""]
["69 years and 0 months","69 years and 5 months",6.39,7.08]
["69 years and 6 months","69 years and 11 months",6.54,7.25]
[null,null,"",""]
["70 years and 0 months","70 years and 5 months",6.69,7.43]
["70 years and 6 months","70 years and 11 months",6.85,7.62]
[null,null,"",""]
["71 years and 0 months","71 years and 5 months",7.01,7.82]
["71 years and 6 months","71 years and 11 months",7.18,8.0299999999999994]
[null,null,"",""]
["72 years and 0 months","72 years and 5 months",7.36,8.24]
["72 years and 6 months","72 years and 11 months",7.55,8.4700000000000006]
[null,null,"",""]
["73 years and 0 months","73 years and 5 months",7.74,8.6999999999999993]
["73 years and 6 months","73 years and 11 months",7.94,8.94]
[null,null,"",""]
["74 years and 0 months","74 years and 5 months",8.15,9.1999999999999993]
["74 years and 6 months","74 years and 11 months",8.36,9.4600000000000009]

{"sheet":"x-806","index":74,"n_rows":85,"n_cols":3,"rows_kept":85,"cut":false,"hidden":false,"merged":[[24,0,24,1]]}
["Government Actuary's Department"]
[{"$f":"IF(TITLE=\"> Enter workbook title here\",\"Enter workbook title in Cover sheet\",TITLE)","v":"Local Government Pension Scheme (LGPS) - Consolidated Factor Spreadsheet"}]
[{"$f":"TABLE_FACTOR_TYPE&\" - x-\"&TABLE_SERIES_NUMBER","v":"AVC to AP - x-806"}]
[]
[]
["Data Item","Factor Table Information"]
["Scheme","LGPS_EW"]
["Section","All"]
["Factor Type","AVC to AP"]
["Description","Use of accumulated AVCs for additional pension (post-14) - Amount of additional annual pension for every £100 of accumulated AVCs - Retirements in normal health"]
["Gender","Male & Female"]
["Factor Age/Period Definition","Age at date member draws benefits from the AVC arrangement under Regulation 17(7), in years and complete months "]
["Section Number",0]
["Series Number",806]
["Table Reference","0-806"]
["Table Reference in Guidance","Table 1"]
["Related Factor Guidance Note","LGPS EW Use of accumulated AVCs to provide additional pension post-14 14 April 2016"]
["Date Factors Issued to Client","2023-09-26"]
["Date Factors Implemented (if known)","2023-10-02"]
["Factor Status","Issued"]
[]
[null,{"$f":"HYPERLINK(\"#'Factor List'!A1\",\"Back to Factor List\")","v":"Back to Factor List"}]
[]
[]
["Age",null,"Pension (£ p.a.)"]
["from","to"]
["55 years and 0 months","55 years and 5 months",3.89]
["55 years and 6 months","55 years and 11 months",3.93]
[null,null,""]
["56 years and 0 months","56 years and 5 months",3.97]
["56 years and 6 months","56 years and 11 months",4.0199999999999996]
[null,null,""]
["57 years and 0 months","57 years and 5 months",4.07]
["57 years and 6 months","57 years and 11 months",4.1100000000000003]
[null,null,""]
["58 years and 0 months","58 years and 5 months",4.16]
["58 years and 6 months","58 years and 11 months",4.21]
[null,null,""]
["59 years and 0 months","59 years and 5 months",4.2699999999999996]
["59 years and 6 months","59 years and 11 months",4.32]
[null,null,""]
["60 years and 0 months","60 years and 5 months",4.38]
["60 years and 6 months","60 years and 11 months",4.43]
[null,null,""]
["61 years and 0 months","61 years and 5 months",4.49]
["61 years and 6 months","61 years and 11 months",4.55]
[null,null,""]
["62 years and 0 months","62 years and 5 months",4.62]
["62 years and 6 months","62 years and 11 months",4.68]
[null,null,""]
["63 years and 0 months","63 years and 5 months",4.75]
["63 years and 6 months","63 years and 11 months",4.82]
[null,null,""]
["64 years and 0 months","64 years and 5 months",4.8899999999999997]
["64 years and 6 months","64 years and 11 months",4.96]
[null,null,""]
["65 years and 0 months","65 years and 5 months",5.04]
["65 years and 6 months","65 years and 11 months",5.13]
[null,null,""]
["66 years and 0 months","66 years and 5 months",5.22]
["66 years and 6 months","66 years and 11 months",5.31]
[null,null,""]
["67 years and 0 months","67 years and 5 months",5.41]
["67 years and 6 months","67 years and 11 months",5.51]
[null,null,""]
["68 years and 0 months","68 years and 5 months",5.61]
["68 years and 6 months","68 years and 11 months",5.72]
[null,null,""]
["69 years and 0 months","69 years and 5 months",5.85]
["69 years and 6 months","69 years and 11 months",5.98]
[null,null,""]
["70 years and 0 months","70 years and 5 months",6.11]
["70 years and 6 months","70 years and 11 months",6.24]
[null,null,""]
["71 years and 0 months","71 years and 5 months",6.38]
["71 years and 6 months","71 years and 11 months",6.52]
[null,null,""]
["72 years and 0 months","72 years and 5 months",6.66]
["72 years and 6 months","72 years and 11 months",6.82]
[null,null,""]
["73 years and 0 months","73 years and 5 months",6.98]
["73 years and 6 months","73 years and 11 months",7.14]
[null,null,""]
["74 years and 0 months","74 years and 5 months",7.32]
["74 years and 6 months","74 years and 11 months",7.52]

{"sheet":"x-807","index":75,"n_rows":160,"n_cols":3,"rows_kept":160,"cut":false,"hidden":false,"merged":[[24,0,24,1]]}
["Government Actuary's Department"]
[{"$f":"IF(TITLE=\"> Enter workbook title here\",\"Enter workbook title in Cover sheet\",TITLE)","v":"Local Government Pension Scheme (LGPS) - Consolidated Factor Spreadsheet"}]
[{"$f":"TABLE_FACTOR_TYPE&\" - x-\"&TABLE_SERIES_NUMBER","v":"AVC to AP - x-807"}]
[]
[]
["Data Item","Factor Table Information"]
["Scheme","LGPS_EW"]
["Section","All"]
["Factor Type","AVC to AP"]
["Description","Use of accumulated AVCs for additional pension (post-14) - Amount of additional annual pension for every £100 of accumulated AVCs - Retirements in ill health"]
["Gender","Male & Female"]
["Factor Age/Period Definition","Age at date member draws benefits from the AVC arrangement under Regulation 17(7), in years and complete months "]
["Section Number",0]
["Series Number",807]
["Table Reference","0-807"]
["Table Reference in Guidance","Table 2"]
["Related Factor Guidance Note","LGPS EW Use of accumulated AVCs to provide additional pension post-14 14 April 2016"]
["Date Factors Issued to Client","2023-09-26"]
["Date Factors Implemented (if known)","2023-10-02"]
["Factor Status","Issued"]
[]
[null,{"$f":"HYPERLINK(\"#'Factor List'!A1\",\"Back to Factor List\")","v":"Back to Factor List"}]
[]
[]
["Age",null,"Pension (£ p.a.)"]
["from","to"]
["30 years and 0 months","30 years and 5 months",3.19]
["30 years and 6 months","30 years and 11 months",3.2]
[null,null,""]
["31 years and 0 months","31 years and 5 months",3.22]
["31 years and 6 months","31 years and 11 months",3.23]
[null,null,""]
["32 years and 0 months","32 years and 5 months",3.24]
["32 years and 6 months","32 years and 11 months",3.26]
[null,null,""]
["33 years and 0 months","33 years and 5 months",3.27]
["33 years and 6 months","33 years and 11 months",3.28]
[null,null,""]
["34 years and 0 months","34 years and 5 months",3.3]
["34 years and 6 months","34 years and 11 months",3.31]
[null,null,""]
["35 years and 0 months","35 years and 5 months",3.33]
["35 years and 6 months","35 years and 11 months",3.34]
[null,null,""]
["36 years and 0 months","36 years and 5 months",3.36]
["36 years and 6 months","36 years and 11 months",3.38]
[null,null,""]
["37 years and 0 months","37 years and 5 months",3.39]
["37 years and 6 months","37 years and 11 months",3.41]
[null,null,""]
["38 years and 0 months","38 years and 5 months",3.42]
["38 years and 6 months","38 years and 11 months",3.44]
[null,null,""]
["39 years and 0 months","39 years and 5 months",3.46]
["39 years and 6 months","39 years and 11 months",3.48]
[null,null,""]
["40 years and 0 months","40 years and 5 months",3.5]
["40 years and 6 months","40 years and 11 months",3.51]
[null,null,""]
["41 years and 0 months","41 years and 5 months",3.53]
["41 years and 6 months","41 years and 11 months",3.55]
[null,null,""]
["42 years and 0 months","42 years and 5 months",3.57]
["42 years and 6 months","42 years and 11 months",3.59]
[null,null,""]
["43 years and 0 months","43 years and 5 months",3.62]
["43 years and 6 months","43 years and 11 months",3.64]
[null,null,""]
["44 years and 0 months","44 years and 5 months",3.66]
["44 years and 6 months","44 years and 11 months",3.68]
[null,null,""]
["45 years and 0 months","45 years and 5 months",3.71]
["45 years and 6 months","45 years and 11 months",3.73]
[null,null,""]
["46 years and 0 months","46 years and 5 months",3.76]
["46 years and 6 months","46 years and 11 months",3.78]
[null,null,""]
["47 years and 0 months","47 years and 5 months",3.81]
["47 years and 6 months","47 years and 11 months",3.83]
[null,null,""]
["48 years and 0 months","48 years and 5 months",3.86]
["48 years and 6 months","48 years and 11 months",3.89]
[null,null,""]
["49 years and 0 months","49 years and 5 months",3.92]
["49 years and 6 months","49 years and 11 months",3.95]
[null,null,""]
["50 years and 0 months","50 years and 5 months",3.98]
["50 years and 6 months","50 years and 11 months",4.01]
[null,null,""]
["51 years and 0 months","51 years and 5 months",4.05]
["51 years and 6 months","51 years and 11 months",4.08]
[null,null,""]
["52 years and 0 months","52 years and 5 months",4.12]
["52 years and 6 months","52 years and 11 months",4.1500000000000004]
[null,null,""]
["53 years and 0 months","53 years and 5 months",4.1900000000000004]
["53 years and 6 months","53 years and 11 months",4.2300000000000004]
[null,null,""]
["54 years and 0 months","54 years and 5 months",4.2699999999999996]
["54 years and 6 months","54 years and 11 months",4.3099999999999996]
[null,null,""]
["55 years and 0 months","55 years and 5 months",4.3600000000000003]
["55 years and 6 months","55 years and 11 months",4.4000000000000004]
[null,null,""]
["56 years and 0 months","56 years and 5 months",4.45]
["56 years and 6 months","56 years and 11 months",4.49]
[null,null,""]
["57 years and 0 months","57 years and 5 months",4.54]
["57 years and 6 months","57 years and 11 months",4.59]
[null,null,""]
["58 years and 0 months","58 years and 5 months",4.6399999999999997]
["58 years and 6 months","58 years and 11 months",4.7]
[null,null,""]
["59 years and 0 months","59 years and 5 months",4.75]
["59 years and 6 months","59 years and 11 months",4.8099999999999996]
[null,null,""]
["60 years and 0 months","60 years and 5 months",4.87]
["60 years and 6 months","60 years and 11 months",4.93]
[null,null,""]
["61 years and 0 months","61 years and 5 months",5]
["61 years and 6 months","61 years and 11 months",5.0599999999999996]
[null,null,""]
["62 years and 0 months","62 years and 5 months",5.13]
["62 years and 6 months","62 years and 11 months",5.2]
[null,null,""]
["63 years and 0 months","63 years and 5 months",5.28]
["63 years and 6 months","63 years and 11 months",5.35]
[null,null,""]
["64 years and 0 months","64 years and 5 months",5.43]
["64 years and 6 months","64 years and 11 months",5.51]
[null,null,""]
["65 years and 0 months","65 years and 5 months",5.61]
["65 years and 6 months","65 years and 11 months",5.72]
[null,null,""]
["66 years and 0 months","66 years and 5 months",5.83]
["66 years and 6 months","66 years and 11 months",5.95]
[null,null,""]
["67 years and 0 months","67 years and 5 months",6.07]
["67 years and 6 months","67 years and 11 months",6.2]
[null,null,""]
["68 years and 0 months","68 years and 5 months",6.34]
["68 years and 6 months","68 years and 11 months",6.48]
[null,null,""]
["69 years and 0 months","69 years and 5 months",6.64]
["69 years and 6 months","69 years and 11 months",6.82]
[null,null,""]
["70 years and 0 months","70 years and 5 months",6.99]
["70 years and 6 months","70 years and 11 months",7.16]
[null,null,""]
["71 years and 0 months","71 years and 5 months",7.34]
["71 years and 6 months","71 years and 11 months",7.53]
[null,null,""]
["72 years and 0 months","72 years and 5 months",7.72]
["72 years and 6 months","72 years and 11 months",7.92]
[null,null,""]
["73 years and 0 months","73 years and 5 months",8.1300000000000008]
["73 years and 6 months","73 years and 11 months",8.35]
[null,null,""]
["74 years and 0 months","74 years and 5 months",8.59]
["74 years and 6 months","74 years and 11 months",8.8699999999999992]

{"sheet":"x-808","index":76,"n_rows":53,"n_cols":29,"rows_kept":53,"cut":false,"hidden":false,"merged":[]}
["Government Actuary's Department"]
[{"$f":"IF(TITLE=\"> Enter workbook title here\",\"Enter workbook title in Cover sheet\",TITLE)","v":"Local Government Pension Scheme (LGPS) - Consolidated Factor Spreadsheet"}]
[{"$f":"TABLE_FACTOR_TYPE&\" - x-\"&TABLE_SERIES_NUMBER","v":"Additional survivor benefits - x-808"}]
[]
[]
["Data Item","Factor Table Information"]
["Client","LGPS_EW"]
["Section","All"]
["Factor Type","Additional survivor benefits"]
["Description","Cost of one year’s additional survivor benefits - Additional survivor benefit contribution rate - cost expressed as a percentage of full time equivalent salary - male member with female partner"]
["Gender","Male"]
["Factor Age/Period Definition","Age at first contribution"]
["Section Number",0]
["Series Number",808]
["Table Reference","0-808"]
["Table Reference in Guidance","Table A"]
["Related Factor Guidance Note","LGPS EW Purchase of Additional Survivor Benefits 5 May 2021"]
["Date Factors Issued to Client","2023-09-26"]
["Date Factors Implemented (if known)","2023-10-02"]
["Factor Status","Issued"]
[]
[null,{"$f":"HYPERLINK(\"#'Factor List'!A1\",\"Back to Factor List\")","v":"Back to Factor List"}]
[]
[]
["Age","Payment period (years) 1","Payment period (years) 2","Payment period (years) 3","Payment period (years) 4","Payment period (years) 5","Payment period (years) 6","Payment period (years) 7","Payment period (years) 8","Payment period (years) 9","Payment period (years) 10","Payment period (years) 11","Payment period (years) 12","Payment period (years) 13","Payment period (years) 14","Payment period (years) 15","Payment period (years) 16","Payment period (years) 17","Payment period (years) 18","Payment period (years) 19","Payment period (years) 20","Payment period (years) 21","Payment period (years) 22","Payment period (years) 23","Payment period (years) 24","Payment period (years) 25","Payment period (years) 26","Payment period (years) 27","Payment period (years) 28"]
[37,4.1099999999999998E-2,2.0500000000000001E-2,1.3599999999999999E-2,1.0200000000000001E-2,8.0999999999999996E-3,6.7999999999999996E-3,5.7999999999999996E-3,5.0000000000000001E-3,4.4999999999999997E-3,4.0000000000000001E-3,3.5999999999999999E-3,3.3E-3,3.0999999999999999E-3,2.8999999999999998E-3,2.7000000000000001E-3,2.5000000000000001E-3,2.3E-3,2.2000000000000001E-3,2.0999999999999999E-3,2E-3,1.9E-3,1.8E-3,1.6999999999999999E-3,1.6999999999999999E-3,1.6000000000000001E-3,1.6000000000000001E-3,1.5E-3,1.4E-3]
[38,4.0800000000000003E-2,2.0299999999999999E-2,1.35E-2,1.01E-2,8.0999999999999996E-3,6.7000000000000002E-3,5.7000000000000002E-3,5.0000000000000001E-3,4.4000000000000003E-3,4.0000000000000001E-3,3.5999999999999999E-3,3.3E-3,3.0999999999999999E-3,2.8E-3,2.7000000000000001E-3,2.5000000000000001E-3,2.3E-3,2.2000000000000001E-3,2.0999999999999999E-3,2E-3,1.9E-3,1.8E-3,1.6999999999999999E-3,1.6999999999999999E-3,1.6000000000000001E-3,1.6000000000000001E-3,1.5E-3,""]
[39,4.0399999999999998E-2,2.0199999999999999E-2,1.34E-2,0.01,8.0000000000000002E-3,6.7000000000000002E-3,5.7000000000000002E-3,5.0000000000000001E-3,4.4000000000000003E-3,4.0000000000000001E-3,3.5999999999999999E-3,3.3E-3,3.0000000000000001E-3,2.8E-3,2.5999999999999999E-3,2.5000000000000001E-3,2.3E-3,2.2000000000000001E-3,2.0999999999999999E-3,2E-3,1.9E-3,1.8E-3,1.6999999999999999E-3,1.6999999999999999E-3,1.6000000000000001E-3,1.5E-3,"",""]
[40,4.0099999999999997E-2,0.02,1.3299999999999999E-2,0.01,7.9000000000000008E-3,6.6E-3,5.7000000000000002E-3,4.8999999999999998E-3,4.4000000000000003E-3,3.8999999999999998E-3,3.5999999999999999E-3,3.3E-3,3.0000000000000001E-3,2.8E-3,2.5999999999999999E-3,2.5000000000000001E-3,2.3E-3,2.2000000000000001E-3,2.0999999999999999E-3,2E-3,1.9E-3,1.8E-3,1.6999999999999999E-3,1.6999999999999999E-3,1.6000000000000001E-3,"","",""]
[41,3.9800000000000002E-2,1.9800000000000002E-2,1.32E-2,9.9000000000000008E-3,7.9000000000000008E-3,6.6E-3,5.5999999999999999E-3,4.8999999999999998E-3,4.4000000000000003E-3,3.8999999999999998E-3,3.5999999999999999E-3,3.3E-3,3.0000000000000001E-3,2.8E-3,2.5999999999999999E-3,2.5000000000000001E-3,2.3E-3,2.2000000000000001E-3,2.0999999999999999E-3,2E-3,1.9E-3,1.8E-3,1.6999999999999999E-3,1.6000000000000001E-3,"","","",""]
[42,3.9399999999999998E-2,1.9699999999999999E-2,1.3100000000000001E-2,9.7999999999999997E-3,7.7999999999999996E-3,6.4999999999999997E-3,5.5999999999999999E-3,4.8999999999999998E-3,4.3E-3,3.8999999999999998E-3,3.5000000000000001E-3,3.3E-3,3.0000000000000001E-3,2.8E-3,2.5999999999999999E-3,2.5000000000000001E-3,2.3E-3,2.2000000000000001E-3,2.0999999999999999E-3,2E-3,1.9E-3,1.8E-3,1.6999999999999999E-3,"","","","",""]
[43,3.9100000000000003E-2,1.95E-2,1.2999999999999999E-2,9.7000000000000003E-3,7.7999999999999996E-3,6.4999999999999997E-3,5.4999999999999997E-3,4.7999999999999996E-3,4.3E-3,3.8999999999999998E-3,3.5000000000000001E-3,3.2000000000000002E-3,3.0000000000000001E-3,2.8E-3,2.5999999999999999E-3,2.3999999999999998E-3,2.3E-3,2.2000000000000001E-3,2.0999999999999999E-3,2E-3,1.9E-3,1.8E-3,"","","","","",""]
[44,3.8800000000000001E-2,1.9300000000000001E-2,1.29E-2,9.5999999999999992E-3,7.7000000000000002E-3,6.4000000000000003E-3,5.4999999999999997E-3,4.7999999999999996E-3,4.3E-3,3.8999999999999998E-3,3.5000000000000001E-3,3.2000000000000002E-3,3.0000000000000001E-3,2.8E-3,2.5999999999999999E-3,2.3999999999999998E-3,2.3E-3,2.2000000000000001E-3,2.0999999999999999E-3,2E-3,1.9E-3,"","","","","","",""]
[45,3.8399999999999997E-2,1.9199999999999998E-2,1.2800000000000001E-2,9.5999999999999992E-3,7.7000000000000002E-3,6.4000000000000003E-3,5.4999999999999997E-3,4.7999999999999996E-3,4.3E-3,3.8E-3,3.5000000000000001E-3,3.2000000000000002E-3,3.0000000000000001E-3,2.8E-3,2.5999999999999999E-3,2.3999999999999998E-3,2.3E-3,2.2000000000000001E-3,2.0999999999999999E-3,1.9E-3,"","","","","","","",""]
[46,3.8100000000000002E-2,1.9E-2,1.2699999999999999E-2,9.4999999999999998E-3,7.6E-3,6.3E-3,5.4000000000000003E-3,4.7999999999999996E-3,4.1999999999999997E-3,3.8E-3,3.5000000000000001E-3,3.2000000000000002E-3,3.0000000000000001E-3,2.8E-3,2.5999999999999999E-3,2.3999999999999998E-3,2.3E-3,2.2000000000000001E-3,2E-3,"","","","","","","","",""]
[47,3.7699999999999997E-2,1.89E-2,1.26E-2,9.4000000000000004E-3,7.6E-3,6.3E-3,5.4000000000000003E-3,4.7999999999999996E-3,4.1999999999999997E-3,3.8E-3,3.5000000000000001E-3,3.2000000000000002E-3,3.0000000000000001E-3,2.8E-3,2.5999999999999999E-3,2.3999999999999998E-3,2.3E-3,2.0999999999999999E-3,"","","","","","","","","",""]
[48,3.7400000000000003E-2,1.8700000000000001E-2,1.2500000000000001E-2,9.4000000000000004E-3,7.4999999999999997E-3,6.3E-3,5.4000000000000003E-3,4.7000000000000002E-3,4.1999999999999997E-3,3.8E-3,3.5000000000000001E-3,3.2000000000000002E-3,3.0000000000000001E-3,2.8E-3,2.5999999999999999E-3,2.3999999999999998E-3,2.3E-3,"","","","","","","","","","",""]
[49,3.7199999999999997E-2,1.8599999999999998E-2,1.24E-2,9.2999999999999992E-3,7.4999999999999997E-3,6.1999999999999998E-3,5.4000000000000003E-3,4.7000000000000002E-3,4.1999999999999997E-3,3.8E-3,3.5000000000000001E-3,3.2000000000000002E-3,2.8999999999999998E-3,2.7000000000000001E-3,2.5999999999999999E-3,2.3999999999999998E-3,"","","","","","","","","","","",""]
[50,3.6999999999999998E-2,1.8499999999999999E-2,1.24E-2,9.2999999999999992E-3,7.4999999999999997E-3,6.1999999999999998E-3,5.3E-3,4.7000000000000002E-3,4.1999999999999997E-3,3.8E-3,3.3999999999999998E-3,3.2000000000000002E-3,2.8999999999999998E-3,2.7000000000000001E-3,2.5000000000000001E-3,"","","","","","","","","","","","",""]
[51,3.6799999999999999E-2,1.84E-2,1.23E-2,9.1999999999999998E-3,7.4000000000000003E-3,6.1999999999999998E-3,5.3E-3,4.7000000000000002E-3,4.1999999999999997E-3,3.8E-3,3.3999999999999998E-3,3.2000000000000002E-3,2.8999999999999998E-3,2.7000000000000001E-3,"","","","","","","","","","","","","",""]
[52,3.6499999999999998E-2,1.83E-2,1.2200000000000001E-2,9.1999999999999998E-3,7.4000000000000003E-3,6.1999999999999998E-3,5.3E-3,4.7000000000000002E-3,4.1999999999999997E-3,3.8E-3,3.3999999999999998E-3,3.2000000000000002E-3,2.8999999999999998E-3,"","","","","","","","","","","","","","",""]
[53,3.6299999999999999E-2,1.8200000000000001E-2,1.2200000000000001E-2,9.1000000000000004E-3,7.3000000000000001E-3,6.1000000000000004E-3,5.3E-3,4.5999999999999999E-3,4.1000000000000003E-3,3.7000000000000002E-3,3.3999999999999998E-3,3.0999999999999999E-3,"","","","","","","","","","","","","","","",""]
[54,3.5999999999999997E-2,1.7999999999999999E-2,1.21E-2,9.1000000000000004E-3,7.3000000000000001E-3,6.1000000000000004E-3,5.3E-3,4.5999999999999999E-3,4.1000000000000003E-3,3.7000000000000002E-3,3.3999999999999998E-3,"","","","","","","","","","","","","","","","",""]
[55,3.5700000000000003E-2,1.7899999999999999E-2,1.2E-2,8.9999999999999993E-3,7.1999999999999998E-3,6.1000000000000004E-3,5.1999999999999998E-3,4.5999999999999999E-3,4.1000000000000003E-3,3.7000000000000002E-3,"","","","","","","","","","","","","","","","","",""]
[56,3.5400000000000001E-2,1.78E-2,1.1900000000000001E-2,8.8999999999999999E-3,7.1999999999999998E-3,6.0000000000000001E-3,5.1999999999999998E-3,4.5999999999999999E-3,4.0000000000000001E-3,"","","","","","","","","","","","","","","","","","",""]
[57,3.5000000000000003E-2,1.7600000000000001E-2,1.18E-2,8.8999999999999999E-3,7.1000000000000004E-3,6.0000000000000001E-3,5.1999999999999998E-3,4.4999999999999997E-3,"","","","","","","","","","","","","","","","","","","",""]
[58,3.4700000000000002E-2,1.7399999999999999E-2,1.17E-2,8.8000000000000005E-3,7.1000000000000004E-3,5.8999999999999999E-3,5.1000000000000004E-3,"","","","","","","","","","","","","","","","","","","","",""]
[59,3.4299999999999997E-2,1.72E-2,1.15E-2,8.6999999999999994E-3,7.0000000000000001E-3,5.7999999999999996E-3,"","","","","","","","","","","","","","","","","","","","","",""]
[60,3.3799999999999997E-2,1.7000000000000001E-2,1.14E-2,8.6E-3,6.8999999999999999E-3,"","","","","","","","","","","","","","","","","","","","","","",""]
[61,3.3399999999999999E-2,1.6799999999999999E-2,1.1299999999999999E-2,8.5000000000000006E-3,"","","","","","","","","","","","","","","","","","","","","","","",""]
[62,3.2899999999999999E-2,1.66E-2,1.11E-2,"","","","","","","","","","","","","","","","","","","","","","","","",""]
[63,3.2399999999999998E-2,1.6299999999999999E-2,"","","","","","","","","","","","","","","","","","","","","","","","","",""]
[64,3.1800000000000002E-2,"","","","","","","","","","","","","","","","","","","","","","","","","","",""]

{"sheet":"x-809","index":77,"n_rows":53,"n_cols":29,"rows_kept":53,"cut":false,"hidden":false,"merged":[]}
["Government Actuary's Department"]
[{"$f":"IF(TITLE=\"> Enter workbook title here\",\"Enter workbook title in Cover sheet\",TITLE)","v":"Local Government Pension Scheme (LGPS) - Consolidated Factor Spreadsheet"}]
[{"$f":"TABLE_FACTOR_TYPE&\" - x-\"&TABLE_SERIES_NUMBER","v":"Additional survivor benefits - x-809"}]
[]
[]
["Data Item","Factor Table Information"]
["Client","LGPS_EW"]
["Section","All"]
["Factor Type","Additional survivor benefits"]
["Description","Cost of one year’s additional survivor benefits - Additional survivor benefit contribution rate - cost expressed as a percentage of full time equivalent salary - female member with male partner"]
["Gender","Female"]
["Factor Age/Period Definition","Age at first contribution"]
["Section Number",0]
["Series Number",809]
["Table Reference","0-809"]
["Table Reference in Guidance","Table B"]
["Related Factor Guidance Note","LGPS EW Purchase of Additional Survivor Benefits 5 May 2021"]
["Date Factors Issued to Client","2023-09-26"]
["Date Factors Implemented (if known)","2023-10-02"]
["Factor Status","Issued"]
[]
[null,{"$f":"HYPERLINK(\"#'Factor List'!A1\",\"Back to Factor List\")","v":"Back to Factor List"}]
[]
[]
["Age","Payment period (years) 1","Payment period (years) 2","Payment period (years) 3","Payment period (years) 4","Payment period (years) 5","Payment period (years) 6","Payment period (years) 7","Payment period (years) 8","Payment period (years) 9","Payment period (years) 10","Payment period (years) 11","Payment period (years) 12","Payment period (years) 13","Payment period (years) 14","Payment period (years) 15","Payment period (years) 16","Payment period (years) 17","Payment period (years) 18","Payment period (years) 19","Payment period (years) 20","Payment period (years) 21","Payment period (years) 22","Payment period (years) 23","Payment period (years) 24","Payment period (years) 25","Payment period (years) 26","Payment period (years) 27","Payment period (years) 28"]
[37,1.6500000000000001E-2,8.2000000000000007E-3,5.4999999999999997E-3,4.1000000000000003E-3,3.3E-3,2.7000000000000001E-3,2.3E-3,2E-3,1.8E-3,1.6000000000000001E-3,1.5E-3,1.4E-3,1.1999999999999999E-3,1.1999999999999999E-3,1.1000000000000001E-3,1E-3,1E-3,8.9999999999999998E-4,8.9999999999999998E-4,8.0000000000000004E-4,8.0000000000000004E-4,6.9999999999999999E-4,6.9999999999999999E-4,6.9999999999999999E-4,6.9999999999999999E-4,5.9999999999999995E-4,5.9999999999999995E-4,5.9999999999999995E-4]
[38,1.6299999999999999E-2,8.2000000000000007E-3,5.4000000000000003E-3,4.1000000000000003E-3,3.2000000000000002E-3,2.7000000000000001E-3,2.3E-3,2E-3,1.8E-3,1.6000000000000001E-3,1.5E-3,1.2999999999999999E-3,1.1999999999999999E-3,1.1999999999999999E-3,1.1000000000000001E-3,1E-3,8.9999999999999998E-4,8.9999999999999998E-4,8.0000000000000004E-4,8.0000000000000004E-4,8.0000000000000004E-4,6.9999999999999999E-4,6.9999999999999999E-4,6.9999999999999999E-4,6.9999999999999999E-4,5.9999999999999995E-4,5.9999999999999995E-4,""]
[39,1.6199999999999999E-2,8.0999999999999996E-3,5.4000000000000003E-3,4.0000000000000001E-3,3.2000000000000002E-3,2.7000000000000001E-3,2.3E-3,2E-3,1.8E-3,1.6000000000000001E-3,1.5E-3,1.2999999999999999E-3,1.1999999999999999E-3,1.1000000000000001E-3,1.1000000000000001E-3,1E-3,8.9999999999999998E-4,8.9999999999999998E-4,8.0000000000000004E-4,8.0000000000000004E-4,8.0000000000000004E-4,6.9999999999999999E-4,6.9999999999999999E-4,6.9999999999999999E-4,5.9999999999999995E-4,5.9999999999999995E-4,"",""]
[40,1.61E-2,8.0000000000000002E-3,5.3E-3,4.0000000000000001E-3,3.2000000000000002E-3,2.7000000000000001E-3,2.3E-3,2E-3,1.8E-3,1.6000000000000001E-3,1.4E-3,1.2999999999999999E-3,1.1999999999999999E-3,1.1000000000000001E-3,1.1000000000000001E-3,1E-3,8.9999999999999998E-4,8.9999999999999998E-4,8.0000000000000004E-4,8.0000000000000004E-4,8.0000000000000004E-4,6.9999999999999999E-4,6.9999999999999999E-4,6.9999999999999999E-4,5.9999999999999995E-4,"","",""]
[41,1.6E-2,8.0000000000000002E-3,5.3E-3,4.0000000000000001E-3,3.2000000000000002E-3,2.5999999999999999E-3,2.3E-3,2E-3,1.8E-3,1.6000000000000001E-3,1.4E-3,1.2999999999999999E-3,1.1999999999999999E-3,1.1000000000000001E-3,1.1000000000000001E-3,1E-3,8.9999999999999998E-4,8.9999999999999998E-4,8.0000000000000004E-4,8.0000000000000004E-4,8.0000000000000004E-4,6.9999999999999999E-4,6.9999999999999999E-4,6.9999999999999999E-4,"","","",""]
[42,1.5800000000000002E-2,7.9000000000000008E-3,5.3E-3,3.8999999999999998E-3,3.2000000000000002E-3,2.5999999999999999E-3,2.2000000000000001E-3,2E-3,1.6999999999999999E-3,1.6000000000000001E-3,1.4E-3,1.2999999999999999E-3,1.1999999999999999E-3,1.1000000000000001E-3,1.1000000000000001E-3,1E-3,8.9999999999999998E-4,8.9999999999999998E-4,8.0000000000000004E-4,8.0000000000000004E-4,8.0000000000000004E-4,6.9999999999999999E-4,6.9999999999999999E-4,"","","","",""]
[43,1.5699999999999999E-2,7.7999999999999996E-3,5.1999999999999998E-3,3.8999999999999998E-3,3.0999999999999999E-3,2.5999999999999999E-3,2.2000000000000001E-3,2E-3,1.6999999999999999E-3,1.6000000000000001E-3,1.4E-3,1.2999999999999999E-3,1.1999999999999999E-3,1.1000000000000001E-3,1E-3,1E-3,8.9999999999999998E-4,8.9999999999999998E-4,8.0000000000000004E-4,8.0000000000000004E-4,8.0000000000000004E-4,6.9999999999999999E-4,"","","","","",""]
[44,1.55E-2,7.7999999999999996E-3,5.1999999999999998E-3,3.8999999999999998E-3,3.0999999999999999E-3,2.5999999999999999E-3,2.2000000000000001E-3,1.9E-3,1.6999999999999999E-3,1.6000000000000001E-3,1.4E-3,1.2999999999999999E-3,1.1999999999999999E-3,1.1000000000000001E-3,1E-3,1E-3,8.9999999999999998E-4,8.9999999999999998E-4,8.0000000000000004E-4,8.0000000000000004E-4,6.9999999999999999E-4,"","","","","","",""]
[45,1.54E-2,7.7000000000000002E-3,5.1000000000000004E-3,3.8E-3,3.0999999999999999E-3,2.5999999999999999E-3,2.2000000000000001E-3,1.9E-3,1.6999999999999999E-3,1.5E-3,1.4E-3,1.2999999999999999E-3,1.1999999999999999E-3,1.1000000000000001E-3,1E-3,1E-3,8.9999999999999998E-4,8.9999999999999998E-4,8.0000000000000004E-4,8.0000000000000004E-4,"","","","","","","",""]
[46,1.5299999999999999E-2,7.6E-3,5.1000000000000004E-3,3.8E-3,3.0000000000000001E-3,2.5000000000000001E-3,2.2000000000000001E-3,1.9E-3,1.6999999999999999E-3,1.5E-3,1.4E-3,1.2999999999999999E-3,1.1999999999999999E-3,1.1000000000000001E-3,1E-3,1E-3,8.9999999999999998E-4,8.9999999999999998E-4,8.0000000000000004E-4,"","","","","","","","",""]
[47,1.5100000000000001E-2,7.6E-3,5.0000000000000001E-3,3.8E-3,3.0000000000000001E-3,2.5000000000000001E-3,2.2000000000000001E-3,1.9E-3,1.6999999999999999E-3,1.5E-3,1.4E-3,1.2999999999999999E-3,1.1999999999999999E-3,1.1000000000000001E-3,1E-3,1E-3,8.9999999999999998E-4,8.0000000000000004E-4,"","","","","","","","","",""]
[48,1.4999999999999999E-2,7.4999999999999997E-3,5.0000000000000001E-3,3.7000000000000002E-3,3.0000000000000001E-3,2.5000000000000001E-3,2.0999999999999999E-3,1.9E-3,1.6999999999999999E-3,1.5E-3,1.4E-3,1.2999999999999999E-3,1.1999999999999999E-3,1.1000000000000001E-3,1E-3,1E-3,8.9999999999999998E-4,"","","","","","","","","","",""]
[49,1.4800000000000001E-2,7.4000000000000003E-3,4.8999999999999998E-3,3.7000000000000002E-3,3.0000000000000001E-3,2.5000000000000001E-3,2.0999999999999999E-3,1.9E-3,1.6999999999999999E-3,1.5E-3,1.4E-3,1.2999999999999999E-3,1.1999999999999999E-3,1.1000000000000001E-3,1E-3,8.9999999999999998E-4,"","","","","","","","","","","",""]
[50,1.47E-2,7.3000000000000001E-3,4.8999999999999998E-3,3.7000000000000002E-3,2.8999999999999998E-3,2.5000000000000001E-3,2.0999999999999999E-3,1.9E-3,1.6000000000000001E-3,1.5E-3,1.4E-3,1.1999999999999999E-3,1.1999999999999999E-3,1.1000000000000001E-3,1E-3,"","","","","","","","","","","","",""]
[51,1.4500000000000001E-2,7.3000000000000001E-3,4.8999999999999998E-3,3.5999999999999999E-3,2.8999999999999998E-3,2.3999999999999998E-3,2.0999999999999999E-3,1.8E-3,1.6000000000000001E-3,1.5E-3,1.2999999999999999E-3,1.1999999999999999E-3,1.1000000000000001E-3,1E-3,"","","","","","","","","","","","","",""]
[52,1.44E-2,7.1999999999999998E-3,4.7999999999999996E-3,3.5999999999999999E-3,2.8999999999999998E-3,2.3999999999999998E-3,2.0999999999999999E-3,1.8E-3,1.6000000000000001E-3,1.5E-3,1.2999999999999999E-3,1.1999999999999999E-3,1.1000000000000001E-3,"","","","","","","","","","","","","","",""]
[53,1.4200000000000001E-2,7.1000000000000004E-3,4.7000000000000002E-3,3.5999999999999999E-3,2.8999999999999998E-3,2.3999999999999998E-3,2.0999999999999999E-3,1.8E-3,1.6000000000000001E-3,1.5E-3,1.2999999999999999E-3,1.1999999999999999E-3,"","","","","","","","","","","","","","","",""]
[54,1.4E-2,7.0000000000000001E-3,4.7000000000000002E-3,3.5000000000000001E-3,2.8E-3,2.3999999999999998E-3,2E-3,1.8E-3,1.6000000000000001E-3,1.4E-3,1.2999999999999999E-3,"","","","","","","","","","","","","","","","",""]
[55,1.38E-2,6.8999999999999999E-3,4.5999999999999999E-3,3.5000000000000001E-3,2.8E-3,2.3E-3,2E-3,1.8E-3,1.6000000000000001E-3,1.4E-3,"","","","","","","","","","","","","","","","","",""]
[56,1.3599999999999999E-2,6.7999999999999996E-3,4.5999999999999999E-3,3.3999999999999998E-3,2.8E-3,2.3E-3,2E-3,1.6999999999999999E-3,1.5E-3,"","","","","","","","","","","","","","","","","","",""]
[57,1.34E-2,6.7000000000000002E-3,4.4999999999999997E-3,3.3999999999999998E-3,2.7000000000000001E-3,2.3E-3,2E-3,1.6999999999999999E-3,"","","","","","","","","","","","","","","","","","","",""]
[58,1.32E-2,6.6E-3,4.4000000000000003E-3,3.3E-3,2.7000000000000001E-3,2.2000000000000001E-3,1.9E-3,"","","","","","","","","","","","","","","","","","","","",""]
[59,1.29E-2,6.4999999999999997E-3,4.4000000000000003E-3,3.3E-3,2.5999999999999999E-3,2.2000000000000001E-3,"","","","","","","","","","","","","","","","","","","","","",""]
[60,1.2699999999999999E-2,6.4000000000000003E-3,4.3E-3,3.2000000000000002E-3,2.5999999999999999E-3,"","","","","","","","","","","","","","","","","","","","","","",""]
[61,1.24E-2,6.3E-3,4.1999999999999997E-3,3.0999999999999999E-3,"","","","","","","","","","","","","","","","","","","","","","","",""]
[62,1.2200000000000001E-2,6.1000000000000004E-3,4.1000000000000003E-3,"","","","","","","","","","","","","","","","","","","","","","","","",""]
[63,1.1900000000000001E-2,5.8999999999999999E-3,"","","","","","","","","","","","","","","","","","","","","","","","","",""]
[64,1.15E-2,"","","","","","","","","","","","","","","","","","","","","","","","","","",""]

{"sheet":"x-810","index":78,"n_rows":53,"n_cols":29,"rows_kept":53,"cut":false,"hidden":false,"merged":[]}
["Government Actuary's Department"]
[{"$f":"IF(TITLE=\"> Enter workbook title here\",\"Enter workbook title in Cover sheet\",TITLE)","v":"Local Government Pension Scheme (LGPS) - Consolidated Factor Spreadsheet"}]
[{"$f":"TABLE_FACTOR_TYPE&\" - x-\"&TABLE_SERIES_NUMBER","v":"Additional survivor benefits - x-810"}]
[]
[]
["Data Item","Factor Table Information"]
["Client","LGPS_EW"]
["Section","All"]
["Factor Type","Additional survivor benefits"]
["Description","Cost of one year’s additional survivor benefits - Additional survivor benefit contribution rate - cost expressed as a percentage of full time equivalent salary - male member with male partner"]
["Gender","Male"]
["Factor Age/Period Definition","Age at first contribution"]
["Section Number",0]
["Series Number",810]
["Table Reference","0-810"]
["Table Reference in Guidance","Table C"]
["Related Factor Guidance Note","LGPS EW Purchase of Additional Survivor Benefits 5 May 2021"]
["Date Factors Issued to Client","2023-09-26"]
["Date Factors Implemented (if known)","2023-10-02"]
["Factor Status","Issued"]
[]
[null,{"$f":"HYPERLINK(\"#'Factor List'!A1\",\"Back to Factor List\")","v":"Back to Factor List"}]
[]
[]
["Age","Payment period (years) 1","Payment period (years) 2","Payment period (years) 3","Payment period (years) 4","Payment period (years) 5","Payment period (years) 6","Payment period (years) 7","Payment period (years) 8","Payment period (years) 9","Payment period (years) 10","Payment period (years) 11","Payment period (years) 12","Payment period (years) 13","Payment period (years) 14","Payment period (years) 15","Payment period (years) 16","Payment period (years) 17","Payment period (years) 18","Payment period (years) 19","Payment period (years) 20","Payment period (years) 21","Payment period (years) 22","Payment period (years) 23","Payment period (years) 24","Payment period (years) 25","Payment period (years) 26","Payment period (years) 27","Payment period (years) 28"]
[37,2.7699999999999999E-2,1.38E-2,9.1999999999999998E-3,6.8999999999999999E-3,5.4999999999999997E-3,4.5999999999999999E-3,3.8999999999999998E-3,3.3999999999999998E-3,3.0000000000000001E-3,2.7000000000000001E-3,2.5000000000000001E-3,2.2000000000000001E-3,2.0999999999999999E-3,1.9E-3,1.8E-3,1.6999999999999999E-3,1.6000000000000001E-3,1.5E-3,1.4E-3,1.2999999999999999E-3,1.2999999999999999E-3,1.1999999999999999E-3,1.1999999999999999E-3,1.1000000000000001E-3,1.1000000000000001E-3,1E-3,1E-3,1E-3]
[38,2.7400000000000001E-2,1.37E-2,9.1000000000000004E-3,6.7999999999999996E-3,5.4000000000000003E-3,4.4999999999999997E-3,3.8999999999999998E-3,3.3999999999999998E-3,3.0000000000000001E-3,2.7000000000000001E-3,2.3999999999999998E-3,2.2000000000000001E-3,2.0999999999999999E-3,1.9E-3,1.8E-3,1.6999999999999999E-3,1.6000000000000001E-3,1.5E-3,1.4E-3,1.2999999999999999E-3,1.2999999999999999E-3,1.1999999999999999E-3,1.1999999999999999E-3,1.1000000000000001E-3,1.1000000000000001E-3,1E-3,1E-3,""]
[39,2.7099999999999999E-2,1.35E-2,8.9999999999999993E-3,6.7000000000000002E-3,5.4000000000000003E-3,4.4999999999999997E-3,3.8E-3,3.3E-3,3.0000000000000001E-3,2.7000000000000001E-3,2.3999999999999998E-3,2.2000000000000001E-3,2E-3,1.9E-3,1.8E-3,1.6999999999999999E-3,1.6000000000000001E-3,1.5E-3,1.4E-3,1.2999999999999999E-3,1.2999999999999999E-3,1.1999999999999999E-3,1.1999999999999999E-3,1.1000000000000001E-3,1.1000000000000001E-3,1E-3,"",""]
[40,2.6800000000000001E-2,1.34E-2,8.8999999999999999E-3,6.7000000000000002E-3,5.3E-3,4.4000000000000003E-3,3.8E-3,3.3E-3,2.8999999999999998E-3,2.5999999999999999E-3,2.3999999999999998E-3,2.2000000000000001E-3,2E-3,1.9E-3,1.8E-3,1.6000000000000001E-3,1.6000000000000001E-3,1.5E-3,1.4E-3,1.2999999999999999E-3,1.2999999999999999E-3,1.1999999999999999E-3,1.1999999999999999E-3,1.1000000000000001E-3,1E-3,"","",""]
[41,2.6499999999999999E-2,1.32E-2,8.8000000000000005E-3,6.6E-3,5.3E-3,4.4000000000000003E-3,3.7000000000000002E-3,3.3E-3,2.8999999999999998E-3,2.5999999999999999E-3,2.3999999999999998E-3,2.2000000000000001E-3,2E-3,1.9E-3,1.6999999999999999E-3,1.6000000000000001E-3,1.5E-3,1.5E-3,1.4E-3,1.2999999999999999E-3,1.2999999999999999E-3,1.1999999999999999E-3,1.1999999999999999E-3,1.1000000000000001E-3,"","","",""]
[42,2.6200000000000001E-2,1.3100000000000001E-2,8.6999999999999994E-3,6.4999999999999997E-3,5.1999999999999998E-3,4.3E-3,3.7000000000000002E-3,3.2000000000000002E-3,2.8999999999999998E-3,2.5999999999999999E-3,2.3999999999999998E-3,2.2000000000000001E-3,2E-3,1.9E-3,1.6999999999999999E-3,1.6000000000000001E-3,1.5E-3,1.5E-3,1.4E-3,1.2999999999999999E-3,1.2999999999999999E-3,1.1999999999999999E-3,1.1000000000000001E-3,"","","","",""]
[43,2.5899999999999999E-2,1.29E-2,8.6E-3,6.4000000000000003E-3,5.1000000000000004E-3,4.3E-3,3.7000000000000002E-3,3.2000000000000002E-3,2.8999999999999998E-3,2.5999999999999999E-3,2.3E-3,2.0999999999999999E-3,2E-3,1.8E-3,1.6999999999999999E-3,1.6000000000000001E-3,1.5E-3,1.4E-3,1.4E-3,1.2999999999999999E-3,1.2999999999999999E-3,1.1999999999999999E-3,"","","","","",""]
[44,2.5600000000000001E-2,1.2800000000000001E-2,8.5000000000000006E-3,6.4000000000000003E-3,5.1000000000000004E-3,4.1999999999999997E-3,3.5999999999999999E-3,3.2000000000000002E-3,2.8E-3,2.5999999999999999E-3,2.3E-3,2.0999999999999999E-3,2E-3,1.8E-3,1.6999999999999999E-3,1.6000000000000001E-3,1.5E-3,1.4E-3,1.4E-3,1.2999999999999999E-3,1.1999999999999999E-3,"","","","","","",""]
[45,2.53E-2,1.26E-2,8.3999999999999995E-3,6.3E-3,5.0000000000000001E-3,4.1999999999999997E-3,3.5999999999999999E-3,3.2000000000000002E-3,2.8E-3,2.5000000000000001E-3,2.3E-3,2.0999999999999999E-3,2E-3,1.8E-3,1.6999999999999999E-3,1.6000000000000001E-3,1.5E-3,1.4E-3,1.4E-3,1.2999999999999999E-3,"","","","","","","",""]
[46,2.5000000000000001E-2,1.2500000000000001E-2,8.3000000000000001E-3,6.1999999999999998E-3,5.0000000000000001E-3,4.1999999999999997E-3,3.5999999999999999E-3,3.0999999999999999E-3,2.8E-3,2.5000000000000001E-3,2.3E-3,2.0999999999999999E-3,1.9E-3,1.8E-3,1.6999999999999999E-3,1.6000000000000001E-3,1.5E-3,1.4E-3,1.2999999999999999E-3,"","","","","","","","",""]
[47,2.47E-2,1.24E-2,8.2000000000000007E-3,6.1999999999999998E-3,5.0000000000000001E-3,4.1000000000000003E-3,3.5000000000000001E-3,3.0999999999999999E-3,2.8E-3,2.5000000000000001E-3,2.3E-3,2.0999999999999999E-3,1.9E-3,1.8E-3,1.6999999999999999E-3,1.6000000000000001E-3,1.5E-3,1.4E-3,"","","","","","","","","",""]
[48,2.4400000000000002E-2,1.2200000000000001E-2,8.2000000000000007E-3,6.1000000000000004E-3,4.8999999999999998E-3,4.1000000000000003E-3,3.5000000000000001E-3,3.0999999999999999E-3,2.7000000000000001E-3,2.5000000000000001E-3,2.3E-3,2.0999999999999999E-3,1.9E-3,1.8E-3,1.6999999999999999E-3,1.6000000000000001E-3,1.5E-3,"","","","","","","","","","",""]
[49,2.4199999999999999E-2,1.21E-2,8.0999999999999996E-3,6.1000000000000004E-3,4.8999999999999998E-3,4.1000000000000003E-3,3.5000000000000001E-3,3.0999999999999999E-3,2.7000000000000001E-3,2.5000000000000001E-3,2.2000000000000001E-3,2.0999999999999999E-3,1.9E-3,1.8E-3,1.6999999999999999E-3,1.5E-3,"","","","","","","","","","","",""]
[50,2.4E-2,1.2E-2,8.0000000000000002E-3,6.0000000000000001E-3,4.7999999999999996E-3,4.0000000000000001E-3,3.5000000000000001E-3,3.0000000000000001E-3,2.7000000000000001E-3,2.3999999999999998E-3,2.2000000000000001E-3,2.0999999999999999E-3,1.9E-3,1.8E-3,1.6000000000000001E-3,"","","","","","","","","","","","",""]
[51,2.3699999999999999E-2,1.1900000000000001E-2,7.9000000000000008E-3,6.0000000000000001E-3,4.7999999999999996E-3,4.0000000000000001E-3,3.3999999999999998E-3,3.0000000000000001E-3,2.7000000000000001E-3,2.3999999999999998E-3,2.2000000000000001E-3,2E-3,1.9E-3,1.6999999999999999E-3,"","","","","","","","","","","","","",""]
[52,2.35E-2,1.18E-2,7.9000000000000008E-3,5.8999999999999999E-3,4.7000000000000002E-3,4.0000000000000001E-3,3.3999999999999998E-3,3.0000000000000001E-3,2.7000000000000001E-3,2.3999999999999998E-3,2.2000000000000001E-3,2E-3,1.8E-3,"","","","","","","","","","","","","","",""]
[53,2.3199999999999998E-2,1.1599999999999999E-2,7.7999999999999996E-3,5.7999999999999996E-3,4.7000000000000002E-3,3.8999999999999998E-3,3.3999999999999998E-3,3.0000000000000001E-3,2.5999999999999999E-3,2.3999999999999998E-3,2.2000000000000001E-3,2E-3,"","","","","","","","","","","","","","","",""]
[54,2.29E-2,1.15E-2,7.7000000000000002E-3,5.7999999999999996E-3,4.5999999999999999E-3,3.8999999999999998E-3,3.3E-3,2.8999999999999998E-3,2.5999999999999999E-3,2.3999999999999998E-3,2.0999999999999999E-3,"","","","","","","","","","","","","","","","",""]
[55,2.2599999999999999E-2,1.14E-2,7.6E-3,5.7000000000000002E-3,4.5999999999999999E-3,3.8E-3,3.3E-3,2.8999999999999998E-3,2.5999999999999999E-3,2.3E-3,"","","","","","","","","","","","","","","","","",""]
[56,2.23E-2,1.12E-2,7.4999999999999997E-3,5.5999999999999999E-3,4.4999999999999997E-3,3.8E-3,3.3E-3,2.8999999999999998E-3,2.5000000000000001E-3,"","","","","","","","","","","","","","","","","","",""]
[57,2.1999999999999999E-2,1.0999999999999999E-2,7.4000000000000003E-3,5.5999999999999999E-3,4.4999999999999997E-3,3.8E-3,3.2000000000000002E-3,2.8E-3,"","","","","","","","","","","","","","","","","","","",""]
[58,2.1600000000000001E-2,1.09E-2,7.3000000000000001E-3,5.4999999999999997E-3,4.4000000000000003E-3,3.7000000000000002E-3,3.0999999999999999E-3,"","","","","","","","","","","","","","","","","","","","",""]
[59,2.12E-2,1.0699999999999999E-2,7.1999999999999998E-3,5.4000000000000003E-3,4.4000000000000003E-3,3.5999999999999999E-3,"","","","","","","","","","","","","","","","","","","","","",""]
[60,2.0799999999999999E-2,1.0500000000000001E-2,7.0000000000000001E-3,5.3E-3,4.1999999999999997E-3,"","","","","","","","","","","","","","","","","","","","","","",""]
[61,2.0400000000000001E-2,1.03E-2,6.8999999999999999E-3,5.1999999999999998E-3,"","","","","","","","","","","","","","","","","","","","","","","",""]
[62,0.02,1.01E-2,6.7000000000000002E-3,"","","","","","","","","","","","","","","","","","","","","","","","",""]
[63,1.95E-2,9.7999999999999997E-3,"","","","","","","","","","","","","","","","","","","","","","","","","",""]
[64,1.9E-2,"","","","","","","","","","","","","","","","","","","","","","","","","","",""]

{"sheet":"x-811","index":79,"n_rows":53,"n_cols":29,"rows_kept":53,"cut":false,"hidden":false,"merged":[]}
["Government Actuary's Department"]
[{"$f":"IF(TITLE=\"> Enter workbook title here\",\"Enter workbook title in Cover sheet\",TITLE)","v":"Local Government Pension Scheme (LGPS) - Consolidated Factor Spreadsheet"}]
[{"$f":"TABLE_FACTOR_TYPE&\" - x-\"&TABLE_SERIES_NUMBER","v":"Additional survivor benefits - x-811"}]
[]
[]
["Data Item","Factor Table Information"]
["Client","LGPS_EW"]
["Section","All"]
["Factor Type","Additional survivor benefits"]
["Description","Cost of one year’s additional survivor benefits - Additional survivor benefit contribution rate - cost expressed as a percentage of full time equivalent salary - female member with female partner"]
["Gender","Female"]
["Factor Age/Period Definition","Age at first contribution"]
["Section Number",0]
["Series Number",811]
["Table Reference","0-811"]
["Table Reference in Guidance","Table D"]
["Related Factor Guidance Note","LGPS EW Purchase of Additional Survivor Benefits 5 May 2021"]
["Date Factors Issued to Client","2023-09-26"]
["Date Factors Implemented (if known)","2023-10-02"]
["Factor Status","Issued"]
[]
[null,{"$f":"HYPERLINK(\"#'Factor List'!A1\",\"Back to Factor List\")","v":"Back to Factor List"}]
[]
[]
["Age","Payment period (years) 1","Payment period (years) 2","Payment period (years) 3","Payment period (years) 4","Payment period (years) 5","Payment period (years) 6","Payment period (years) 7","Payment period (years) 8","Payment period (years) 9","Payment period (years) 10","Payment period (years) 11","Payment period (years) 12","Payment period (years) 13","Payment period (years) 14","Payment period (years) 15","Payment period (years) 16","Payment period (years) 17","Payment period (years) 18","Payment period (years) 19","Payment period (years) 20","Payment period (years) 21","Payment period (years) 22","Payment period (years) 23","Payment period (years) 24","Payment period (years) 25","Payment period (years) 26","Payment period (years) 27","Payment period (years) 28"]
[37,2.4E-2,1.2E-2,8.0000000000000002E-3,6.0000000000000001E-3,4.7999999999999996E-3,4.0000000000000001E-3,3.3999999999999998E-3,3.0000000000000001E-3,2.5999999999999999E-3,2.3999999999999998E-3,2.2000000000000001E-3,2E-3,1.8E-3,1.6999999999999999E-3,1.6000000000000001E-3,1.5E-3,1.4E-3,1.2999999999999999E-3,1.1999999999999999E-3,1.1999999999999999E-3,1.1000000000000001E-3,1.1000000000000001E-3,1E-3,1E-3,1E-3,8.9999999999999998E-4,8.9999999999999998E-4,8.0000000000000004E-4]
[38,2.3900000000000001E-2,1.1900000000000001E-2,7.9000000000000008E-3,5.8999999999999999E-3,4.7000000000000002E-3,3.8999999999999998E-3,3.3999999999999998E-3,3.0000000000000001E-3,2.5999999999999999E-3,2.3999999999999998E-3,2.0999999999999999E-3,2E-3,1.8E-3,1.6999999999999999E-3,1.6000000000000001E-3,1.5E-3,1.4E-3,1.2999999999999999E-3,1.1999999999999999E-3,1.1999999999999999E-3,1.1000000000000001E-3,1.1000000000000001E-3,1E-3,1E-3,1E-3,8.9999999999999998E-4,8.9999999999999998E-4,""]
[39,2.3699999999999999E-2,1.1900000000000001E-2,7.9000000000000008E-3,5.8999999999999999E-3,4.7000000000000002E-3,3.8999999999999998E-3,3.3999999999999998E-3,2.8999999999999998E-3,2.5999999999999999E-3,2.3E-3,2.0999999999999999E-3,2E-3,1.8E-3,1.6999999999999999E-3,1.6000000000000001E-3,1.5E-3,1.4E-3,1.2999999999999999E-3,1.1999999999999999E-3,1.1999999999999999E-3,1.1000000000000001E-3,1.1000000000000001E-3,1E-3,1E-3,1E-3,8.9999999999999998E-4,"",""]
[40,2.3599999999999999E-2,1.18E-2,7.7999999999999996E-3,5.8999999999999999E-3,4.7000000000000002E-3,3.8999999999999998E-3,3.3E-3,2.8999999999999998E-3,2.5999999999999999E-3,2.3E-3,2.0999999999999999E-3,1.9E-3,1.8E-3,1.6999999999999999E-3,1.6000000000000001E-3,1.5E-3,1.4E-3,1.2999999999999999E-3,1.1999999999999999E-3,1.1999999999999999E-3,1.1000000000000001E-3,1.1000000000000001E-3,1E-3,1E-3,8.9999999999999998E-4,"","",""]
[41,2.35E-2,1.17E-2,7.7999999999999996E-3,5.7999999999999996E-3,4.7000000000000002E-3,3.8999999999999998E-3,3.3E-3,2.8999999999999998E-3,2.5999999999999999E-3,2.3E-3,2.0999999999999999E-3,1.9E-3,1.8E-3,1.6999999999999999E-3,1.6000000000000001E-3,1.5E-3,1.4E-3,1.2999999999999999E-3,1.1999999999999999E-3,1.1999999999999999E-3,1.1000000000000001E-3,1.1000000000000001E-3,1E-3,1E-3,"","","",""]
[42,2.3300000000000001E-2,1.17E-2,7.7999999999999996E-3,5.7999999999999996E-3,4.5999999999999999E-3,3.8999999999999998E-3,3.3E-3,2.8999999999999998E-3,2.5999999999999999E-3,2.3E-3,2.0999999999999999E-3,1.9E-3,1.8E-3,1.6999999999999999E-3,1.6000000000000001E-3,1.5E-3,1.4E-3,1.2999999999999999E-3,1.1999999999999999E-3,1.1999999999999999E-3,1.1000000000000001E-3,1.1000000000000001E-3,1E-3,"","","","",""]
[43,2.3199999999999998E-2,1.1599999999999999E-2,7.7000000000000002E-3,5.7999999999999996E-3,4.5999999999999999E-3,3.8E-3,3.3E-3,2.8999999999999998E-3,2.5999999999999999E-3,2.3E-3,2.0999999999999999E-3,1.9E-3,1.8E-3,1.6999999999999999E-3,1.5E-3,1.5E-3,1.4E-3,1.2999999999999999E-3,1.1999999999999999E-3,1.1999999999999999E-3,1.1000000000000001E-3,1.1000000000000001E-3,"","","","","",""]
[44,2.3E-2,1.15E-2,7.7000000000000002E-3,5.7000000000000002E-3,4.5999999999999999E-3,3.8E-3,3.3E-3,2.8999999999999998E-3,2.5999999999999999E-3,2.3E-3,2.0999999999999999E-3,1.9E-3,1.8E-3,1.6999999999999999E-3,1.5E-3,1.4E-3,1.4E-3,1.2999999999999999E-3,1.1999999999999999E-3,1.1999999999999999E-3,1.1000000000000001E-3,"","","","","","",""]
[45,2.29E-2,1.14E-2,7.6E-3,5.7000000000000002E-3,4.5999999999999999E-3,3.8E-3,3.3E-3,2.8999999999999998E-3,2.5000000000000001E-3,2.3E-3,2.0999999999999999E-3,1.9E-3,1.8E-3,1.6000000000000001E-3,1.5E-3,1.4E-3,1.4E-3,1.2999999999999999E-3,1.1999999999999999E-3,1.1000000000000001E-3,"","","","","","","",""]
[46,2.2700000000000001E-2,1.14E-2,7.6E-3,5.7000000000000002E-3,4.4999999999999997E-3,3.8E-3,3.3E-3,2.8E-3,2.5000000000000001E-3,2.3E-3,2.0999999999999999E-3,1.9E-3,1.8E-3,1.6000000000000001E-3,1.5E-3,1.4E-3,1.4E-3,1.2999999999999999E-3,1.1999999999999999E-3,"","","","","","","","",""]
[47,2.2599999999999999E-2,1.1299999999999999E-2,7.4999999999999997E-3,5.7000000000000002E-3,4.4999999999999997E-3,3.8E-3,3.2000000000000002E-3,2.8E-3,2.5000000000000001E-3,2.3E-3,2.0999999999999999E-3,1.9E-3,1.8E-3,1.6000000000000001E-3,1.5E-3,1.4E-3,1.4E-3,1.2999999999999999E-3,"","","","","","","","","",""]
[48,2.24E-2,1.12E-2,7.4999999999999997E-3,5.5999999999999999E-3,4.4999999999999997E-3,3.8E-3,3.2000000000000002E-3,2.8E-3,2.5000000000000001E-3,2.3E-3,2.0999999999999999E-3,1.9E-3,1.8E-3,1.6000000000000001E-3,1.5E-3,1.4E-3,1.2999999999999999E-3,"","","","","","","","","","",""]
[49,2.23E-2,1.12E-2,7.4000000000000003E-3,5.5999999999999999E-3,4.4999999999999997E-3,3.7000000000000002E-3,3.2000000000000002E-3,2.8E-3,2.5000000000000001E-3,2.3E-3,2.0999999999999999E-3,1.9E-3,1.6999999999999999E-3,1.6000000000000001E-3,1.5E-3,1.4E-3,"","","","","","","","","","","",""]
[50,2.2200000000000001E-2,1.11E-2,7.4000000000000003E-3,5.5999999999999999E-3,4.4999999999999997E-3,3.7000000000000002E-3,3.2000000000000002E-3,2.8E-3,2.5000000000000001E-3,2.2000000000000001E-3,2E-3,1.9E-3,1.6999999999999999E-3,1.6000000000000001E-3,1.5E-3,"","","","","","","","","","","","",""]
[51,2.1999999999999999E-2,1.0999999999999999E-2,7.4000000000000003E-3,5.4999999999999997E-3,4.4000000000000003E-3,3.7000000000000002E-3,3.2000000000000002E-3,2.8E-3,2.5000000000000001E-3,2.2000000000000001E-3,2E-3,1.9E-3,1.6999999999999999E-3,1.6000000000000001E-3,"","","","","","","","","","","","","",""]
[52,2.1899999999999999E-2,1.09E-2,7.3000000000000001E-3,5.4999999999999997E-3,4.4000000000000003E-3,3.7000000000000002E-3,3.2000000000000002E-3,2.8E-3,2.5000000000000001E-3,2.2000000000000001E-3,2E-3,1.9E-3,1.6999999999999999E-3,"","","","","","","","","","","","","","",""]
[53,2.1700000000000001E-2,1.09E-2,7.3000000000000001E-3,5.4999999999999997E-3,4.4000000000000003E-3,3.7000000000000002E-3,3.0999999999999999E-3,2.8E-3,2.5000000000000001E-3,2.2000000000000001E-3,2E-3,1.8E-3,"","","","","","","","","","","","","","","",""]
[54,2.1499999999999998E-2,1.0800000000000001E-2,7.1999999999999998E-3,5.4000000000000003E-3,4.3E-3,3.5999999999999999E-3,3.0999999999999999E-3,2.7000000000000001E-3,2.3999999999999998E-3,2.2000000000000001E-3,2E-3,"","","","","","","","","","","","","","","","",""]
[55,2.1299999999999999E-2,1.0699999999999999E-2,7.1000000000000004E-3,5.4000000000000003E-3,4.3E-3,3.5999999999999999E-3,3.0999999999999999E-3,2.7000000000000001E-3,2.3999999999999998E-3,2.2000000000000001E-3,"","","","","","","","","","","","","","","","","",""]
[56,2.1100000000000001E-2,1.06E-2,7.1000000000000004E-3,5.3E-3,4.3E-3,3.5999999999999999E-3,3.0999999999999999E-3,2.7000000000000001E-3,2.3999999999999998E-3,"","","","","","","","","","","","","","","","","","",""]
[57,2.0899999999999998E-2,1.0500000000000001E-2,7.0000000000000001E-3,5.3E-3,4.1999999999999997E-3,3.5000000000000001E-3,3.0999999999999999E-3,2.5999999999999999E-3,"","","","","","","","","","","","","","","","","","","",""]
[58,2.06E-2,1.04E-2,6.8999999999999999E-3,5.1999999999999998E-3,4.1999999999999997E-3,3.5000000000000001E-3,3.0000000000000001E-3,"","","","","","","","","","","","","","","","","","","","",""]
[59,2.0400000000000001E-2,1.0200000000000001E-2,6.8999999999999999E-3,5.1999999999999998E-3,4.1999999999999997E-3,3.3999999999999998E-3,"","","","","","","","","","","","","","","","","","","","","",""]
[60,2.01E-2,1.01E-2,6.7999999999999996E-3,5.1000000000000004E-3,4.1000000000000003E-3,"","","","","","","","","","","","","","","","","","","","","","",""]
[61,1.9800000000000002E-2,0.01,6.7000000000000002E-3,5.0000000000000001E-3,"","","","","","","","","","","","","","","","","","","","","","","",""]
[62,1.95E-2,9.7999999999999997E-3,6.4999999999999997E-3,"","","","","","","","","","","","","","","","","","","","","","","","",""]
[63,1.9199999999999998E-2,9.5999999999999992E-3,"","","","","","","","","","","","","","","","","","","","","","","","","",""]
[64,1.8800000000000001E-2,"","","","","","","","","","","","","","","","","","","","","","","","","","",""]